{"text_format":"1","workbook":"xlsx","n_sheets":6,"sheets":["Inicio","Alumnos","Tareas","Calificaciones","Asistencia","Hide"],"not_rendered":{"charts":0,"images":2,"macros":1,"external_links":0,"defined_names":0,"comments":0,"pivot_tables":0},"unopened":[],"bounds":{"document_bytes":16777216,"sheet_cells":100000,"rows_first":2000,"rows_last":500,"rows_between":2000,"halvings":0,"cell_chars":16384,"cell_head_chars":4096},"cells_cut":0,"cells_raw":0,"read":"whole","date_system":"1900"}

{"sheet":"Inicio","index":0,"n_rows":0,"n_cols":0,"rows_kept":0,"cut":false,"hidden":false,"merged":[]}

{"sheet":"Alumnos","index":1,"n_rows":6,"n_cols":8,"rows_kept":6,"cut":false,"hidden":false,"merged":[]}
[null,"Nombre Completo","Reading - número de aciertos totales ","Evaluación Writing (según rubrica)","Listening - numero de aciertos totales","Evaluacion Speaking (según rubrica)","Examen Final Parte 1","Examen Final Parte 2"]
[null,"Flores Tinajero Mauricio Gabriel",6,20,16,24,20,45]
[null,"Granados Hernandez Brenda Paola ",5,20,15,22,14,40]
[null,"Ledezma Cano Andrea ",4,22,12,25,16,43]
[null,"Arturo",null,null,null,null,12,12]
[null,"Michel",null,null,null,null,12,12]

{"sheet":"Tareas","index":2,"n_rows":2,"n_cols":26,"rows_kept":2,"cut":false,"hidden":false,"merged":[]}
[null,"READING","# reactivos","WRITING","# reactivos","LISTENING","# reactivos","SPEAKING","# reactivos",null,null,null,null,null,null,null,null,null,null,null,null,null,{"$f":"SUM(C2:C100)","v":12},{"$f":"SUM(E2:E100)","v":0},{"$f":"SUM(G2:G100)","v":12},{"$f":"SUM(I2:I100)","v":0}]
[null,"tarea 1",12,null,null,"tarea 1",12]

{"sheet":"Calificaciones","index":3,"n_rows":501,"n_cols":13,"rows_kept":501,"cut":false,"hidden":false,"merged":[]}
[null,"ALUMNO","READING","WRITING","LISTENING","SPEAKING","EXAMEN FINAL PARTE 1","EXAMEN FINAL PARTE 2",null,"Total Skills","Calificación Examen Final",null,"Calificación final del nivel"]
[null,{"$f":"IF(Alumnos!B2<>\"\",Alumnos!B2,\"\")","v":"Flores Tinajero Mauricio Gabriel"},{"$f":"IF(Tareas!$W$1,Alumnos!C2*(30/Tareas!$W$1),\"\")","v":15},{"$f":"Alumnos!D2","v":20},{"$f":"IF(Tareas!$Y$1,Alumnos!E2*(30/Tareas!$Y$1),\"\")","v":40},{"$f":"Alumnos!F2","v":24},{"$f":"Alumnos!G2","v":20},{"$f":"Alumnos!H2","v":45},null,{"$f":"SUM(C2:F2)","v":99},{"$f":"SUM(G2:H2)","v":65},null,{"$f":"(J2+K2)/2","v":82}]
[null,{"$f":"IF(Alumnos!B3<>\"\",Alumnos!B3,\"\")","v":"Granados Hernandez Brenda Paola "},{"$f":"IF(Tareas!$W$1,Alumnos!C3*(30/Tareas!$W$1),\"\")","v":12.5},{"$f":"Alumnos!D3","v":20},{"$f":"IF(Tareas!$Y$1,Alumnos!E3*(30/Tareas!$Y$1),\"\")","v":37.5},{"$f":"Alumnos!F3","v":22},{"$f":"Alumnos!G3","v":14},{"$f":"Alumnos!H3","v":40},null,{"$f":"SUM(C3:F3)","v":92},{"$f":"SUM(G3:H3)","v":54},null,{"$f":"(J3+K3)/2","v":73}]
[null,{"$f":"IF(Alumnos!B4<>\"\",Alumnos!B4,\"\")","v":"Ledezma Cano Andrea "},{"$f":"IF(Tareas!$W$1,Alumnos!C4*(30/Tareas!$W$1),\"\")","v":10},{"$f":"Alumnos!D4","v":22},{"$f":"IF(Tareas!$Y$1,Alumnos!E4*(30/Tareas!$Y$1),\"\")","v":30},{"$f":"Alumnos!F4","v":25},{"$f":"Alumnos!G4","v":16},{"$f":"Alumnos!H4","v":43},null,87,59,null,73]
[null,{"$f":"IF(Alumnos!B5<>\"\",Alumnos!B5,\"\")","v":"Arturo"},{"$f":"IF(Tareas!$W$1,Alumnos!C5*(30/Tareas!$W$1),\"\")","v":0},{"$f":"Alumnos!D5","v":0},{"$f":"IF(Tareas!$Y$1,Alumnos!E5*(30/Tareas!$Y$1),\"\")","v":0},{"$f":"Alumnos!F5","v":0},{"$f":"Alumnos!G5","v":12},{"$f":"Alumnos!H5","v":12},null,0,24,null,12]
[null,{"$f":"IF(Alumnos!B6<>\"\",Alumnos!B6,\"\")","v":"Michel"},{"$f":"IF(Tareas!$W$1,Alumnos!C6*(30/Tareas!$W$1),\"\")","v":0},{"$f":"Alumnos!D6","v":0},{"$f":"IF(Tareas!$Y$1,Alumnos!E6*(30/Tareas!$Y$1),\"\")","v":0},{"$f":"Alumnos!F6","v":0},{"$f":"Alumnos!G6","v":12},{"$f":"Alumnos!H6","v":12},null,0,24,null,12]
[null,{"$f":"IF(Alumnos!B7<>\"\",Alumnos!B7,\"\")","v":""},{"$f":"IF(Tareas!$W$1,Alumnos!C7*(30/Tareas!$W$1),\"\")","v":0},{"$f":"Alumnos!D7","v":0},{"$f":"IF(Tareas!$Y$1,Alumnos!E7*(30/Tareas!$Y$1),\"\")","v":0},{"$f":"Alumnos!F7","v":0},{"$f":"Alumnos!G7","v":0},{"$f":"Alumnos!H7","v":0},null,0,0,null,0]
[null,{"$f":"IF(Alumnos!B8<>\"\",Alumnos!B8,\"\")","v":""},{"$f":"IF(Tareas!$W$1,Alumnos!C8*(30/Tareas!$W$1),\"\")","v":0},{"$f":"Alumnos!D8","v":0},{"$f":"IF(Tareas!$Y$1,Alumnos!E8*(30/Tareas!$Y$1),\"\")","v":0},{"$f":"Alumnos!F8","v":0},{"$f":"Alumnos!G8","v":0},{"$f":"Alumnos!H8","v":0},null,0,0,null,0]
[null,{"$f":"IF(Alumnos!B9<>\"\",Alumnos!B9,\"\")","v":""},{"$f":"IF(Tareas!$W$1,Alumnos!C9*(30/Tareas!$W$1),\"\")","v":0},{"$f":"Alumnos!D9","v":0},{"$f":"IF(Tareas!$Y$1,Alumnos!E9*(30/Tareas!$Y$1),\"\")","v":0},{"$f":"Alumnos!F9","v":0},{"$f":"Alumnos!G9","v":0},{"$f":"Alumnos!H9","v":0},null,0,0,null,0]
[null,{"$f":"IF(Alumnos!B10<>\"\",Alumnos!B10,\"\")","v":""},{"$f":"IF(Tareas!$W$1,Alumnos!C10*(30/Tareas!$W$1),\"\")","v":0},{"$f":"Alumnos!D10","v":0},{"$f":"IF(Tareas!$Y$1,Alumnos!E10*(30/Tareas!$Y$1),\"\")","v":0},{"$f":"Alumnos!F10","v":0},{"$f":"Alumnos!G10","v":0},{"$f":"Alumnos!H10","v":0},null,0,0,null,0]
[null,{"$f":"IF(Alumnos!B11<>\"\",Alumnos!B11,\"\")","v":""},{"$f":"IF(Tareas!$W$1,Alumnos!C11*(30/Tareas!$W$1),\"\")","v":0},{"$f":"Alumnos!D11","v":0},{"$f":"IF(Tareas!$Y$1,Alumnos!E11*(30/Tareas!$Y$1),\"\")","v":0},{"$f":"Alumnos!F11","v":0},{"$f":"Alumnos!G11","v":0},{"$f":"Alumnos!H11","v":0},null,0,0,null,0]
[null,{"$f":"IF(Alumnos!B12<>\"\",Alumnos!B12,\"\")","v":""},{"$f":"IF(Tareas!$W$1,Alumnos!C12*(30/Tareas!$W$1),\"\")","v":0},{"$f":"Alumnos!D12","v":0},{"$f":"IF(Tareas!$Y$1,Alumnos!E12*(30/Tareas!$Y$1),\"\")","v":0},{"$f":"Alumnos!F12","v":0},{"$f":"Alumnos!G12","v":0},{"$f":"Alumnos!H12","v":0},null,0,0,null,0]
[null,{"$f":"IF(Alumnos!B13<>\"\",Alumnos!B13,\"\")","v":""},{"$f":"IF(Tareas!$W$1,Alumnos!C13*(30/Tareas!$W$1),\"\")","v":0},{"$f":"Alumnos!D13","v":0},{"$f":"IF(Tareas!$Y$1,Alumnos!E13*(30/Tareas!$Y$1),\"\")","v":0},{"$f":"Alumnos!F13","v":0},{"$f":"Alumnos!G13","v":0},{"$f":"Alumnos!H13","v":0},null,0,0,null,0]
[null,{"$f":"IF(Alumnos!B14<>\"\",Alumnos!B14,\"\")","v":""},{"$f":"IF(Tareas!$W$1,Alumnos!C14*(30/Tareas!$W$1),\"\")","v":0},{"$f":"Alumnos!D14","v":0},{"$f":"IF(Tareas!$Y$1,Alumnos!E14*(30/Tareas!$Y$1),\"\")","v":0},{"$f":"Alumnos!F14","v":0},{"$f":"Alumnos!G14","v":0},{"$f":"Alumnos!H14","v":0},null,0,0,null,0]
[null,{"$f":"IF(Alumnos!B15<>\"\",Alumnos!B15,\"\")","v":""},{"$f":"IF(Tareas!$W$1,Alumnos!C15*(30/Tareas!$W$1),\"\")","v":0},{"$f":"Alumnos!D15","v":0},{"$f":"IF(Tareas!$Y$1,Alumnos!E15*(30/Tareas!$Y$1),\"\")","v":0},{"$f":"Alumnos!F15","v":0},{"$f":"Alumnos!G15","v":0},{"$f":"Alumnos!H15","v":0},null,0,0,null,0]
[null,{"$f":"IF(Alumnos!B16<>\"\",Alumnos!B16,\"\")","v":""},{"$f":"IF(Tareas!$W$1,Alumnos!C16*(30/Tareas!$W$1),\"\")","v":0},{"$f":"Alumnos!D16","v":0},{"$f":"IF(Tareas!$Y$1,Alumnos!E16*(30/Tareas!$Y$1),\"\")","v":0},{"$f":"Alumnos!F16","v":0},{"$f":"Alumnos!G16","v":0},{"$f":"Alumnos!H16","v":0},null,0,0,null,0]
[null,{"$f":"IF(Alumnos!B17<>\"\",Alumnos!B17,\"\")","v":""},{"$f":"IF(Tareas!$W$1,Alumnos!C17*(30/Tareas!$W$1),\"\")","v":0},{"$f":"Alumnos!D17","v":0},{"$f":"IF(Tareas!$Y$1,Alumnos!E17*(30/Tareas!$Y$1),\"\")","v":0},{"$f":"Alumnos!F17","v":0},{"$f":"Alumnos!G17","v":0},{"$f":"Alumnos!H17","v":0},null,0,0,null,0]
[null,{"$f":"IF(Alumnos!B18<>\"\",Alumnos!B18,\"\")","v":""},{"$f":"IF(Tareas!$W$1,Alumnos!C18*(30/Tareas!$W$1),\"\")","v":0},{"$f":"Alumnos!D18","v":0},{"$f":"IF(Tareas!$Y$1,Alumnos!E18*(30/Tareas!$Y$1),\"\")","v":0},{"$f":"Alumnos!F18","v":0},{"$f":"Alumnos!G18","v":0},{"$f":"Alumnos!H18","v":0},null,0,0,null,0]
[null,{"$f":"IF(Alumnos!B19<>\"\",Alumnos!B19,\"\")","v":""},{"$f":"IF(Tareas!$W$1,Alumnos!C19*(30/Tareas!$W$1),\"\")","v":0},{"$f":"Alumnos!D19","v":0},{"$f":"IF(Tareas!$Y$1,Alumnos!E19*(30/Tareas!$Y$1),\"\")","v":0},{"$f":"Alumnos!F19","v":0},{"$f":"Alumnos!G19","v":0},{"$f":"Alumnos!H19","v":0},null,0,0,null,0]
[null,{"$f":"IF(Alumnos!B20<>\"\",Alumnos!B20,\"\")","v":""},{"$f":"IF(Tareas!$W$1,Alumnos!C20*(30/Tareas!$W$1),\"\")","v":0},{"$f":"Alumnos!D20","v":0},{"$f":"IF(Tareas!$Y$1,Alumnos!E20*(30/Tareas!$Y$1),\"\")","v":0},{"$f":"Alumnos!F20","v":0},{"$f":"Alumnos!G20","v":0},{"$f":"Alumnos!H20","v":0},null,0,0,null,0]
[null,{"$f":"IF(Alumnos!B21<>\"\",Alumnos!B21,\"\")","v":""},{"$f":"IF(Tareas!$W$1,Alumnos!C21*(30/Tareas!$W$1),\"\")","v":0},{"$f":"Alumnos!D21","v":0},{"$f":"IF(Tareas!$Y$1,Alumnos!E21*(30/Tareas!$Y$1),\"\")","v":0},{"$f":"Alumnos!F21","v":0},{"$f":"Alumnos!G21","v":0},{"$f":"Alumnos!H21","v":0},null,0,0,null,0]
[null,{"$f":"IF(Alumnos!B22<>\"\",Alumnos!B22,\"\")","v":""},{"$f":"IF(Tareas!$W$1,Alumnos!C22*(30/Tareas!$W$1),\"\")","v":0},{"$f":"Alumnos!D22","v":0},{"$f":"IF(Tareas!$Y$1,Alumnos!E22*(30/Tareas!$Y$1),\"\")","v":0},{"$f":"Alumnos!F22","v":0},{"$f":"Alumnos!G22","v":0},{"$f":"Alumnos!H22","v":0},null,0,0,null,0]
[null,{"$f":"IF(Alumnos!B23<>\"\",Alumnos!B23,\"\")","v":""},{"$f":"IF(Tareas!$W$1,Alumnos!C23*(30/Tareas!$W$1),\"\")","v":0},{"$f":"Alumnos!D23","v":0},{"$f":"IF(Tareas!$Y$1,Alumnos!E23*(30/Tareas!$Y$1),\"\")","v":0},{"$f":"Alumnos!F23","v":0},{"$f":"Alumnos!G23","v":0},{"$f":"Alumnos!H23","v":0},null,0,0,null,0]
[null,{"$f":"IF(Alumnos!B24<>\"\",Alumnos!B24,\"\")","v":""},{"$f":"IF(Tareas!$W$1,Alumnos!C24*(30/Tareas!$W$1),\"\")","v":0},{"$f":"Alumnos!D24","v":0},{"$f":"IF(Tareas!$Y$1,Alumnos!E24*(30/Tareas!$Y$1),\"\")","v":0},{"$f":"Alumnos!F24","v":0},{"$f":"Alumnos!G24","v":0},{"$f":"Alumnos!H24","v":0},null,0,0,null,0]
[null,{"$f":"IF(Alumnos!B25<>\"\",Alumnos!B25,\"\")","v":""},{"$f":"IF(Tareas!$W$1,Alumnos!C25*(30/Tareas!$W$1),\"\")","v":0},{"$f":"Alumnos!D25","v":0},{"$f":"IF(Tareas!$Y$1,Alumnos!E25*(30/Tareas!$Y$1),\"\")","v":0},{"$f":"Alumnos!F25","v":0},{"$f":"Alumnos!G25","v":0},{"$f":"Alumnos!H25","v":0},null,0,0,null,0]
[null,{"$f":"IF(Alumnos!B26<>\"\",Alumnos!B26,\"\")","v":""},{"$f":"IF(Tareas!$W$1,Alumnos!C26*(30/Tareas!$W$1),\"\")","v":0},{"$f":"Alumnos!D26","v":0},{"$f":"IF(Tareas!$Y$1,Alumnos!E26*(30/Tareas!$Y$1),\"\")","v":0},{"$f":"Alumnos!F26","v":0},{"$f":"Alumnos!G26","v":0},{"$f":"Alumnos!H26","v":0},null,0,0,null,0]
[null,{"$f":"IF(Alumnos!B27<>\"\",Alumnos!B27,\"\")","v":""},{"$f":"IF(Tareas!$W$1,Alumnos!C27*(30/Tareas!$W$1),\"\")","v":0},{"$f":"Alumnos!D27","v":0},{"$f":"IF(Tareas!$Y$1,Alumnos!E27*(30/Tareas!$Y$1),\"\")","v":0},{"$f":"Alumnos!F27","v":0},{"$f":"Alumnos!G27","v":0},{"$f":"Alumnos!H27","v":0},null,0,0,null,0]
[null,{"$f":"IF(Alumnos!B28<>\"\",Alumnos!B28,\"\")","v":""},{"$f":"IF(Tareas!$W$1,Alumnos!C28*(30/Tareas!$W$1),\"\")","v":0},{"$f":"Alumnos!D28","v":0},{"$f":"IF(Tareas!$Y$1,Alumnos!E28*(30/Tareas!$Y$1),\"\")","v":0},{"$f":"Alumnos!F28","v":0},{"$f":"Alumnos!G28","v":0},{"$f":"Alumnos!H28","v":0},null,0,0,null,0]
[null,{"$f":"IF(Alumnos!B29<>\"\",Alumnos!B29,\"\")","v":""},{"$f":"IF(Tareas!$W$1,Alumnos!C29*(30/Tareas!$W$1),\"\")","v":0},{"$f":"Alumnos!D29","v":0},{"$f":"IF(Tareas!$Y$1,Alumnos!E29*(30/Tareas!$Y$1),\"\")","v":0},{"$f":"Alumnos!F29","v":0},{"$f":"Alumnos!G29","v":0},{"$f":"Alumnos!H29","v":0},null,0,0,null,0]
[null,{"$f":"IF(Alumnos!B30<>\"\",Alumnos!B30,\"\")","v":""},{"$f":"IF(Tareas!$W$1,Alumnos!C30*(30/Tareas!$W$1),\"\")","v":0},{"$f":"Alumnos!D30","v":0},{"$f":"IF(Tareas!$Y$1,Alumnos!E30*(30/Tareas!$Y$1),\"\")","v":0},{"$f":"Alumnos!F30","v":0},{"$f":"Alumnos!G30","v":0},{"$f":"Alumnos!H30","v":0},null,0,0,null,0]
[null,{"$f":"IF(Alumnos!B31<>\"\",Alumnos!B31,\"\")","v":""},{"$f":"IF(Tareas!$W$1,Alumnos!C31*(30/Tareas!$W$1),\"\")","v":0},{"$f":"Alumnos!D31","v":0},{"$f":"IF(Tareas!$Y$1,Alumnos!E31*(30/Tareas!$Y$1),\"\")","v":0},{"$f":"Alumnos!F31","v":0},{"$f":"Alumnos!G31","v":0},{"$f":"Alumnos!H31","v":0},null,0,0,null,0]
[null,{"$f":"IF(Alumnos!B32<>\"\",Alumnos!B32,\"\")","v":""},{"$f":"IF(Tareas!$W$1,Alumnos!C32*(30/Tareas!$W$1),\"\")","v":0},{"$f":"Alumnos!D32","v":0},{"$f":"IF(Tareas!$Y$1,Alumnos!E32*(30/Tareas!$Y$1),\"\")","v":0},{"$f":"Alumnos!F32","v":0},{"$f":"Alumnos!G32","v":0},{"$f":"Alumnos!H32","v":0},null,0,0,null,0]
[null,{"$f":"IF(Alumnos!B33<>\"\",Alumnos!B33,\"\")","v":""},{"$f":"IF(Tareas!$W$1,Alumnos!C33*(30/Tareas!$W$1),\"\")","v":0},{"$f":"Alumnos!D33","v":0},{"$f":"IF(Tareas!$Y$1,Alumnos!E33*(30/Tareas!$Y$1),\"\")","v":0},{"$f":"Alumnos!F33","v":0},{"$f":"Alumnos!G33","v":0},{"$f":"Alumnos!H33","v":0},null,0,0,null,0]
[null,{"$f":"IF(Alumnos!B34<>\"\",Alumnos!B34,\"\")","v":""},{"$f":"IF(Tareas!$W$1,Alumnos!C34*(30/Tareas!$W$1),\"\")","v":0},{"$f":"Alumnos!D34","v":0},{"$f":"IF(Tareas!$Y$1,Alumnos!E34*(30/Tareas!$Y$1),\"\")","v":0},{"$f":"Alumnos!F34","v":0},{"$f":"Alumnos!G34","v":0},{"$f":"Alumnos!H34","v":0},null,0,0,null,0]
[null,{"$f":"IF(Alumnos!B35<>\"\",Alumnos!B35,\"\")","v":""},{"$f":"IF(Tareas!$W$1,Alumnos!C35*(30/Tareas!$W$1),\"\")","v":0},{"$f":"Alumnos!D35","v":0},{"$f":"IF(Tareas!$Y$1,Alumnos!E35*(30/Tareas!$Y$1),\"\")","v":0},{"$f":"Alumnos!F35","v":0},{"$f":"Alumnos!G35","v":0},{"$f":"Alumnos!H35","v":0},null,0,0,null,0]
[null,{"$f":"IF(Alumnos!B36<>\"\",Alumnos!B36,\"\")","v":""},{"$f":"IF(Tareas!$W$1,Alumnos!C36*(30/Tareas!$W$1),\"\")","v":0},{"$f":"Alumnos!D36","v":0},{"$f":"IF(Tareas!$Y$1,Alumnos!E36*(30/Tareas!$Y$1),\"\")","v":0},{"$f":"Alumnos!F36","v":0},{"$f":"Alumnos!G36","v":0},{"$f":"Alumnos!H36","v":0},null,0,0,null,0]
[null,{"$f":"IF(Alumnos!B37<>\"\",Alumnos!B37,\"\")","v":""},{"$f":"IF(Tareas!$W$1,Alumnos!C37*(30/Tareas!$W$1),\"\")","v":0},{"$f":"Alumnos!D37","v":0},{"$f":"IF(Tareas!$Y$1,Alumnos!E37*(30/Tareas!$Y$1),\"\")","v":0},{"$f":"Alumnos!F37","v":0},{"$f":"Alumnos!G37","v":0},{"$f":"Alumnos!H37","v":0},null,0,0,null,0]
[null,{"$f":"IF(Alumnos!B38<>\"\",Alumnos!B38,\"\")","v":""},{"$f":"IF(Tareas!$W$1,Alumnos!C38*(30/Tareas!$W$1),\"\")","v":0},{"$f":"Alumnos!D38","v":0},{"$f":"IF(Tareas!$Y$1,Alumnos!E38*(30/Tareas!$Y$1),\"\")","v":0},{"$f":"Alumnos!F38","v":0},{"$f":"Alumnos!G38","v":0},{"$f":"Alumnos!H38","v":0},null,0,0,null,0]
[null,{"$f":"IF(Alumnos!B39<>\"\",Alumnos!B39,\"\")","v":""},{"$f":"IF(Tareas!$W$1,Alumnos!C39*(30/Tareas!$W$1),\"\")","v":0},{"$f":"Alumnos!D39","v":0},{"$f":"IF(Tareas!$Y$1,Alumnos!E39*(30/Tareas!$Y$1),\"\")","v":0},{"$f":"Alumnos!F39","v":0},{"$f":"Alumnos!G39","v":0},{"$f":"Alumnos!H39","v":0},null,0,0,null,0]
[null,{"$f":"IF(Alumnos!B40<>\"\",Alumnos!B40,\"\")","v":""},{"$f":"IF(Tareas!$W$1,Alumnos!C40*(30/Tareas!$W$1),\"\")","v":0},{"$f":"Alumnos!D40","v":0},{"$f":"IF(Tareas!$Y$1,Alumnos!E40*(30/Tareas!$Y$1),\"\")","v":0},{"$f":"Alumnos!F40","v":0},{"$f":"Alumnos!G40","v":0},{"$f":"Alumnos!H40","v":0},null,0,0,null,0]
[null,{"$f":"IF(Alumnos!B41<>\"\",Alumnos!B41,\"\")","v":""},{"$f":"IF(Tareas!$W$1,Alumnos!C41*(30/Tareas!$W$1),\"\")","v":0},{"$f":"Alumnos!D41","v":0},{"$f":"IF(Tareas!$Y$1,Alumnos!E41*(30/Tareas!$Y$1),\"\")","v":0},{"$f":"Alumnos!F41","v":0},{"$f":"Alumnos!G41","v":0},{"$f":"Alumnos!H41","v":0},null,0,0,null,0]
[null,{"$f":"IF(Alumnos!B42<>\"\",Alumnos!B42,\"\")","v":""},{"$f":"IF(Tareas!$W$1,Alumnos!C42*(30/Tareas!$W$1),\"\")","v":0},{"$f":"Alumnos!D42","v":0},{"$f":"IF(Tareas!$Y$1,Alumnos!E42*(30/Tareas!$Y$1),\"\")","v":0},{"$f":"Alumnos!F42","v":0},{"$f":"Alumnos!G42","v":0},{"$f":"Alumnos!H42","v":0},null,0,0,null,0]
[null,{"$f":"IF(Alumnos!B43<>\"\",Alumnos!B43,\"\")","v":""},{"$f":"IF(Tareas!$W$1,Alumnos!C43*(30/Tareas!$W$1),\"\")","v":0},{"$f":"Alumnos!D43","v":0},{"$f":"IF(Tareas!$Y$1,Alumnos!E43*(30/Tareas!$Y$1),\"\")","v":0},{"$f":"Alumnos!F43","v":0},{"$f":"Alumnos!G43","v":0},{"$f":"Alumnos!H43","v":0},null,0,0,null,0]
[null,{"$f":"IF(Alumnos!B44<>\"\",Alumnos!B44,\"\")","v":""},{"$f":"IF(Tareas!$W$1,Alumnos!C44*(30/Tareas!$W$1),\"\")","v":0},{"$f":"Alumnos!D44","v":0},{"$f":"IF(Tareas!$Y$1,Alumnos!E44*(30/Tareas!$Y$1),\"\")","v":0},{"$f":"Alumnos!F44","v":0},{"$f":"Alumnos!G44","v":0},{"$f":"Alumnos!H44","v":0},null,0,0,null,0]
[null,{"$f":"IF(Alumnos!B45<>\"\",Alumnos!B45,\"\")","v":""},{"$f":"IF(Tareas!$W$1,Alumnos!C45*(30/Tareas!$W$1),\"\")","v":0},{"$f":"Alumnos!D45","v":0},{"$f":"IF(Tareas!$Y$1,Alumnos!E45*(30/Tareas!$Y$1),\"\")","v":0},{"$f":"Alumnos!F45","v":0},{"$f":"Alumnos!G45","v":0},{"$f":"Alumnos!H45","v":0},null,0,0,null,0]
[null,{"$f":"IF(Alumnos!B46<>\"\",Alumnos!B46,\"\")","v":""},{"$f":"IF(Tareas!$W$1,Alumnos!C46*(30/Tareas!$W$1),\"\")","v":0},{"$f":"Alumnos!D46","v":0},{"$f":"IF(Tareas!$Y$1,Alumnos!E46*(30/Tareas!$Y$1),\"\")","v":0},{"$f":"Alumnos!F46","v":0},{"$f":"Alumnos!G46","v":0},{"$f":"Alumnos!H46","v":0},null,0,0,null,0]
[null,{"$f":"IF(Alumnos!B47<>\"\",Alumnos!B47,\"\")","v":""},{"$f":"IF(Tareas!$W$1,Alumnos!C47*(30/Tareas!$W$1),\"\")","v":0},{"$f":"Alumnos!D47","v":0},{"$f":"IF(Tareas!$Y$1,Alumnos!E47*(30/Tareas!$Y$1),\"\")","v":0},{"$f":"Alumnos!F47","v":0},{"$f":"Alumnos!G47","v":0},{"$f":"Alumnos!H47","v":0},null,0,0,null,0]
[null,{"$f":"IF(Alumnos!B48<>\"\",Alumnos!B48,\"\")","v":""},{"$f":"IF(Tareas!$W$1,Alumnos!C48*(30/Tareas!$W$1),\"\")","v":0},{"$f":"Alumnos!D48","v":0},{"$f":"IF(Tareas!$Y$1,Alumnos!E48*(30/Tareas!$Y$1),\"\")","v":0},{"$f":"Alumnos!F48","v":0},{"$f":"Alumnos!G48","v":0},{"$f":"Alumnos!H48","v":0},null,0,0,null,0]
[null,{"$f":"IF(Alumnos!B49<>\"\",Alumnos!B49,\"\")","v":""},{"$f":"IF(Tareas!$W$1,Alumnos!C49*(30/Tareas!$W$1),\"\")","v":0},{"$f":"Alumnos!D49","v":0},{"$f":"IF(Tareas!$Y$1,Alumnos!E49*(30/Tareas!$Y$1),\"\")","v":0},{"$f":"Alumnos!F49","v":0},{"$f":"Alumnos!G49","v":0},{"$f":"Alumnos!H49","v":0},null,0,0,null,0]
[null,{"$f":"IF(Alumnos!B50<>\"\",Alumnos!B50,\"\")","v":""},{"$f":"IF(Tareas!$W$1,Alumnos!C50*(30/Tareas!$W$1),\"\")","v":0},{"$f":"Alumnos!D50","v":0},{"$f":"IF(Tareas!$Y$1,Alumnos!E50*(30/Tareas!$Y$1),\"\")","v":0},{"$f":"Alumnos!F50","v":0},{"$f":"Alumnos!G50","v":0},{"$f":"Alumnos!H50","v":0},null,0,0,null,0]
[null,{"$f":"IF(Alumnos!B51<>\"\",Alumnos!B51,\"\")","v":""},{"$f":"IF(Tareas!$W$1,Alumnos!C51*(30/Tareas!$W$1),\"\")","v":0},{"$f":"Alumnos!D51","v":0},{"$f":"IF(Tareas!$Y$1,Alumnos!E51*(30/Tareas!$Y$1),\"\")","v":0},{"$f":"Alumnos!F51","v":0},{"$f":"Alumnos!G51","v":0},{"$f":"Alumnos!H51","v":0},null,0,0,null,0]
[null,{"$f":"IF(Alumnos!B52<>\"\",Alumnos!B52,\"\")","v":""},{"$f":"IF(Tareas!$W$1,Alumnos!C52*(30/Tareas!$W$1),\"\")","v":0},{"$f":"Alumnos!D52","v":0},{"$f":"IF(Tareas!$Y$1,Alumnos!E52*(30/Tareas!$Y$1),\"\")","v":0},{"$f":"Alumnos!F52","v":0},{"$f":"Alumnos!G52","v":0},{"$f":"Alumnos!H52","v":0},null,0,0,null,0]
[null,{"$f":"IF(Alumnos!B53<>\"\",Alumnos!B53,\"\")","v":""},{"$f":"IF(Tareas!$W$1,Alumnos!C53*(30/Tareas!$W$1),\"\")","v":0},{"$f":"Alumnos!D53","v":0},{"$f":"IF(Tareas!$Y$1,Alumnos!E53*(30/Tareas!$Y$1),\"\")","v":0},{"$f":"Alumnos!F53","v":0},{"$f":"Alumnos!G53","v":0},{"$f":"Alumnos!H53","v":0},null,0,0,null,0]
[null,{"$f":"IF(Alumnos!B54<>\"\",Alumnos!B54,\"\")","v":""},{"$f":"IF(Tareas!$W$1,Alumnos!C54*(30/Tareas!$W$1),\"\")","v":0},{"$f":"Alumnos!D54","v":0},{"$f":"IF(Tareas!$Y$1,Alumnos!E54*(30/Tareas!$Y$1),\"\")","v":0},{"$f":"Alumnos!F54","v":0},{"$f":"Alumnos!G54","v":0},{"$f":"Alumnos!H54","v":0},null,0,0,null,0]
[null,{"$f":"IF(Alumnos!B55<>\"\",Alumnos!B55,\"\")","v":""},{"$f":"IF(Tareas!$W$1,Alumnos!C55*(30/Tareas!$W$1),\"\")","v":0},{"$f":"Alumnos!D55","v":0},{"$f":"IF(Tareas!$Y$1,Alumnos!E55*(30/Tareas!$Y$1),\"\")","v":0},{"$f":"Alumnos!F55","v":0},{"$f":"Alumnos!G55","v":0},{"$f":"Alumnos!H55","v":0},null,0,0,null,0]
[null,{"$f":"IF(Alumnos!B56<>\"\",Alumnos!B56,\"\")","v":""},{"$f":"IF(Tareas!$W$1,Alumnos!C56*(30/Tareas!$W$1),\"\")","v":0},{"$f":"Alumnos!D56","v":0},{"$f":"IF(Tareas!$Y$1,Alumnos!E56*(30/Tareas!$Y$1),\"\")","v":0},{"$f":"Alumnos!F56","v":0},{"$f":"Alumnos!G56","v":0},{"$f":"Alumnos!H56","v":0},null,0,0,null,0]
[null,{"$f":"IF(Alumnos!B57<>\"\",Alumnos!B57,\"\")","v":""},{"$f":"IF(Tareas!$W$1,Alumnos!C57*(30/Tareas!$W$1),\"\")","v":0},{"$f":"Alumnos!D57","v":0},{"$f":"IF(Tareas!$Y$1,Alumnos!E57*(30/Tareas!$Y$1),\"\")","v":0},{"$f":"Alumnos!F57","v":0},{"$f":"Alumnos!G57","v":0},{"$f":"Alumnos!H57","v":0},null,0,0,null,0]
[null,{"$f":"IF(Alumnos!B58<>\"\",Alumnos!B58,\"\")","v":""},{"$f":"IF(Tareas!$W$1,Alumnos!C58*(30/Tareas!$W$1),\"\")","v":0},{"$f":"Alumnos!D58","v":0},{"$f":"IF(Tareas!$Y$1,Alumnos!E58*(30/Tareas!$Y$1),\"\")","v":0},{"$f":"Alumnos!F58","v":0},{"$f":"Alumnos!G58","v":0},{"$f":"Alumnos!H58","v":0},null,0,0,null,0]
[null,{"$f":"IF(Alumnos!B59<>\"\",Alumnos!B59,\"\")","v":""},{"$f":"IF(Tareas!$W$1,Alumnos!C59*(30/Tareas!$W$1),\"\")","v":0},{"$f":"Alumnos!D59","v":0},{"$f":"IF(Tareas!$Y$1,Alumnos!E59*(30/Tareas!$Y$1),\"\")","v":0},{"$f":"Alumnos!F59","v":0},{"$f":"Alumnos!G59","v":0},{"$f":"Alumnos!H59","v":0},null,0,0,null,0]
[null,{"$f":"IF(Alumnos!B60<>\"\",Alumnos!B60,\"\")","v":""},{"$f":"IF(Tareas!$W$1,Alumnos!C60*(30/Tareas!$W$1),\"\")","v":0},{"$f":"Alumnos!D60","v":0},{"$f":"IF(Tareas!$Y$1,Alumnos!E60*(30/Tareas!$Y$1),\"\")","v":0},{"$f":"Alumnos!F60","v":0},{"$f":"Alumnos!G60","v":0},{"$f":"Alumnos!H60","v":0},null,0,0,null,0]
[null,{"$f":"IF(Alumnos!B61<>\"\",Alumnos!B61,\"\")","v":""},{"$f":"IF(Tareas!$W$1,Alumnos!C61*(30/Tareas!$W$1),\"\")","v":0},{"$f":"Alumnos!D61","v":0},{"$f":"IF(Tareas!$Y$1,Alumnos!E61*(30/Tareas!$Y$1),\"\")","v":0},{"$f":"Alumnos!F61","v":0},{"$f":"Alumnos!G61","v":0},{"$f":"Alumnos!H61","v":0},null,0,0,null,0]
[null,{"$f":"IF(Alumnos!B62<>\"\",Alumnos!B62,\"\")","v":""},{"$f":"IF(Tareas!$W$1,Alumnos!C62*(30/Tareas!$W$1),\"\")","v":0},{"$f":"Alumnos!D62","v":0},{"$f":"IF(Tareas!$Y$1,Alumnos!E62*(30/Tareas!$Y$1),\"\")","v":0},{"$f":"Alumnos!F62","v":0},{"$f":"Alumnos!G62","v":0},{"$f":"Alumnos!H62","v":0},null,0,0,null,0]
[null,{"$f":"IF(Alumnos!B63<>\"\",Alumnos!B63,\"\")","v":""},{"$f":"IF(Tareas!$W$1,Alumnos!C63*(30/Tareas!$W$1),\"\")","v":0},{"$f":"Alumnos!D63","v":0},{"$f":"IF(Tareas!$Y$1,Alumnos!E63*(30/Tareas!$Y$1),\"\")","v":0},{"$f":"Alumnos!F63","v":0},{"$f":"Alumnos!G63","v":0},{"$f":"Alumnos!H63","v":0},null,0,0,null,0]
[null,{"$f":"IF(Alumnos!B64<>\"\",Alumnos!B64,\"\")","v":""},{"$f":"IF(Tareas!$W$1,Alumnos!C64*(30/Tareas!$W$1),\"\")","v":0},{"$f":"Alumnos!D64","v":0},{"$f":"IF(Tareas!$Y$1,Alumnos!E64*(30/Tareas!$Y$1),\"\")","v":0},{"$f":"Alumnos!F64","v":0},{"$f":"Alumnos!G64","v":0},{"$f":"Alumnos!H64","v":0},null,0,0,null,0]
[null,{"$f":"IF(Alumnos!B65<>\"\",Alumnos!B65,\"\")","v":""},{"$f":"IF(Tareas!$W$1,Alumnos!C65*(30/Tareas!$W$1),\"\")","v":0},{"$f":"Alumnos!D65","v":0},{"$f":"IF(Tareas!$Y$1,Alumnos!E65*(30/Tareas!$Y$1),\"\")","v":0},{"$f":"Alumnos!F65","v":0},{"$f":"Alumnos!G65","v":0},{"$f":"Alumnos!H65","v":0},null,0,0,null,0]
[null,{"$f":"IF(Alumnos!B66<>\"\",Alumnos!B66,\"\")","v":""},{"$f":"IF(Tareas!$W$1,Alumnos!C66*(30/Tareas!$W$1),\"\")","v":0},{"$f":"Alumnos!D66","v":0},{"$f":"IF(Tareas!$Y$1,Alumnos!E66*(30/Tareas!$Y$1),\"\")","v":0},{"$f":"Alumnos!F66","v":0},{"$f":"Alumnos!G66","v":0},{"$f":"Alumnos!H66","v":0},null,0,0,null,0]
[null,{"$f":"IF(Alumnos!B67<>\"\",Alumnos!B67,\"\")","v":""},{"$f":"IF(Tareas!$W$1,Alumnos!C67*(30/Tareas!$W$1),\"\")","v":0},{"$f":"Alumnos!D67","v":0},{"$f":"IF(Tareas!$Y$1,Alumnos!E67*(30/Tareas!$Y$1),\"\")","v":0},{"$f":"Alumnos!F67","v":0},{"$f":"Alumnos!G67","v":0},{"$f":"Alumnos!H67","v":0},null,{"$f":"SUM(C67:F67)","v":0},{"$f":"SUM(G67:H67)","v":0},null,{"$f":"(J67+K67)/2","v":0}]
[null,{"$f":"IF(Alumnos!B68<>\"\",Alumnos!B68,\"\")","v":""},{"$f":"IF(Tareas!$W$1,Alumnos!C68*(30/Tareas!$W$1),\"\")","v":0},{"$f":"Alumnos!D68","v":0},{"$f":"IF(Tareas!$Y$1,Alumnos!E68*(30/Tareas!$Y$1),\"\")","v":0},{"$f":"Alumnos!F68","v":0},{"$f":"Alumnos!G68","v":0},{"$f":"Alumnos!H68","v":0},null,0,0,null,0]
[null,{"$f":"IF(Alumnos!B69<>\"\",Alumnos!B69,\"\")","v":""},{"$f":"IF(Tareas!$W$1,Alumnos!C69*(30/Tareas!$W$1),\"\")","v":0},{"$f":"Alumnos!D69","v":0},{"$f":"IF(Tareas!$Y$1,Alumnos!E69*(30/Tareas!$Y$1),\"\")","v":0},{"$f":"Alumnos!F69","v":0},{"$f":"Alumnos!G69","v":0},{"$f":"Alumnos!H69","v":0},null,0,0,null,0]
[null,{"$f":"IF(Alumnos!B70<>\"\",Alumnos!B70,\"\")","v":""},{"$f":"IF(Tareas!$W$1,Alumnos!C70*(30/Tareas!$W$1),\"\")","v":0},{"$f":"Alumnos!D70","v":0},{"$f":"IF(Tareas!$Y$1,Alumnos!E70*(30/Tareas!$Y$1),\"\")","v":0},{"$f":"Alumnos!F70","v":0},{"$f":"Alumnos!G70","v":0},{"$f":"Alumnos!H70","v":0},null,0,0,null,0]
[null,{"$f":"IF(Alumnos!B71<>\"\",Alumnos!B71,\"\")","v":""},{"$f":"IF(Tareas!$W$1,Alumnos!C71*(30/Tareas!$W$1),\"\")","v":0},{"$f":"Alumnos!D71","v":0},{"$f":"IF(Tareas!$Y$1,Alumnos!E71*(30/Tareas!$Y$1),\"\")","v":0},{"$f":"Alumnos!F71","v":0},{"$f":"Alumnos!G71","v":0},{"$f":"Alumnos!H71","v":0},null,0,0,null,0]
[null,{"$f":"IF(Alumnos!B72<>\"\",Alumnos!B72,\"\")","v":""},{"$f":"IF(Tareas!$W$1,Alumnos!C72*(30/Tareas!$W$1),\"\")","v":0},{"$f":"Alumnos!D72","v":0},{"$f":"IF(Tareas!$Y$1,Alumnos!E72*(30/Tareas!$Y$1),\"\")","v":0},{"$f":"Alumnos!F72","v":0},{"$f":"Alumnos!G72","v":0},{"$f":"Alumnos!H72","v":0},null,0,0,null,0]
[null,{"$f":"IF(Alumnos!B73<>\"\",Alumnos!B73,\"\")","v":""},{"$f":"IF(Tareas!$W$1,Alumnos!C73*(30/Tareas!$W$1),\"\")","v":0},{"$f":"Alumnos!D73","v":0},{"$f":"IF(Tareas!$Y$1,Alumnos!E73*(30/Tareas!$Y$1),\"\")","v":0},{"$f":"Alumnos!F73","v":0},{"$f":"Alumnos!G73","v":0},{"$f":"Alumnos!H73","v":0},null,0,0,null,0]
[null,{"$f":"IF(Alumnos!B74<>\"\",Alumnos!B74,\"\")","v":""},{"$f":"IF(Tareas!$W$1,Alumnos!C74*(30/Tareas!$W$1),\"\")","v":0},{"$f":"Alumnos!D74","v":0},{"$f":"IF(Tareas!$Y$1,Alumnos!E74*(30/Tareas!$Y$1),\"\")","v":0},{"$f":"Alumnos!F74","v":0},{"$f":"Alumnos!G74","v":0},{"$f":"Alumnos!H74","v":0},null,0,0,null,0]
[null,{"$f":"IF(Alumnos!B75<>\"\",Alumnos!B75,\"\")","v":""},{"$f":"IF(Tareas!$W$1,Alumnos!C75*(30/Tareas!$W$1),\"\")","v":0},{"$f":"Alumnos!D75","v":0},{"$f":"IF(Tareas!$Y$1,Alumnos!E75*(30/Tareas!$Y$1),\"\")","v":0},{"$f":"Alumnos!F75","v":0},{"$f":"Alumnos!G75","v":0},{"$f":"Alumnos!H75","v":0},null,0,0,null,0]
[null,{"$f":"IF(Alumnos!B76<>\"\",Alumnos!B76,\"\")","v":""},{"$f":"IF(Tareas!$W$1,Alumnos!C76*(30/Tareas!$W$1),\"\")","v":0},{"$f":"Alumnos!D76","v":0},{"$f":"IF(Tareas!$Y$1,Alumnos!E76*(30/Tareas!$Y$1),\"\")","v":0},{"$f":"Alumnos!F76","v":0},{"$f":"Alumnos!G76","v":0},{"$f":"Alumnos!H76","v":0},null,0,0,null,0]
[null,{"$f":"IF(Alumnos!B77<>\"\",Alumnos!B77,\"\")","v":""},{"$f":"IF(Tareas!$W$1,Alumnos!C77*(30/Tareas!$W$1),\"\")","v":0},{"$f":"Alumnos!D77","v":0},{"$f":"IF(Tareas!$Y$1,Alumnos!E77*(30/Tareas!$Y$1),\"\")","v":0},{"$f":"Alumnos!F77","v":0},{"$f":"Alumnos!G77","v":0},{"$f":"Alumnos!H77","v":0},null,0,0,null,0]
[null,{"$f":"IF(Alumnos!B78<>\"\",Alumnos!B78,\"\")","v":""},{"$f":"IF(Tareas!$W$1,Alumnos!C78*(30/Tareas!$W$1),\"\")","v":0},{"$f":"Alumnos!D78","v":0},{"$f":"IF(Tareas!$Y$1,Alumnos!E78*(30/Tareas!$Y$1),\"\")","v":0},{"$f":"Alumnos!F78","v":0},{"$f":"Alumnos!G78","v":0},{"$f":"Alumnos!H78","v":0},null,0,0,null,0]
[null,{"$f":"IF(Alumnos!B79<>\"\",Alumnos!B79,\"\")","v":""},{"$f":"IF(Tareas!$W$1,Alumnos!C79*(30/Tareas!$W$1),\"\")","v":0},{"$f":"Alumnos!D79","v":0},{"$f":"IF(Tareas!$Y$1,Alumnos!E79*(30/Tareas!$Y$1),\"\")","v":0},{"$f":"Alumnos!F79","v":0},{"$f":"Alumnos!G79","v":0},{"$f":"Alumnos!H79","v":0},null,0,0,null,0]
[null,{"$f":"IF(Alumnos!B80<>\"\",Alumnos!B80,\"\")","v":""},{"$f":"IF(Tareas!$W$1,Alumnos!C80*(30/Tareas!$W$1),\"\")","v":0},{"$f":"Alumnos!D80","v":0},{"$f":"IF(Tareas!$Y$1,Alumnos!E80*(30/Tareas!$Y$1),\"\")","v":0},{"$f":"Alumnos!F80","v":0},{"$f":"Alumnos!G80","v":0},{"$f":"Alumnos!H80","v":0},null,0,0,null,0]
[null,{"$f":"IF(Alumnos!B81<>\"\",Alumnos!B81,\"\")","v":""},{"$f":"IF(Tareas!$W$1,Alumnos!C81*(30/Tareas!$W$1),\"\")","v":0},{"$f":"Alumnos!D81","v":0},{"$f":"IF(Tareas!$Y$1,Alumnos!E81*(30/Tareas!$Y$1),\"\")","v":0},{"$f":"Alumnos!F81","v":0},{"$f":"Alumnos!G81","v":0},{"$f":"Alumnos!H81","v":0},null,0,0,null,0]
[null,{"$f":"IF(Alumnos!B82<>\"\",Alumnos!B82,\"\")","v":""},{"$f":"IF(Tareas!$W$1,Alumnos!C82*(30/Tareas!$W$1),\"\")","v":0},{"$f":"Alumnos!D82","v":0},{"$f":"IF(Tareas!$Y$1,Alumnos!E82*(30/Tareas!$Y$1),\"\")","v":0},{"$f":"Alumnos!F82","v":0},{"$f":"Alumnos!G82","v":0},{"$f":"Alumnos!H82","v":0},null,0,0,null,0]
[null,{"$f":"IF(Alumnos!B83<>\"\",Alumnos!B83,\"\")","v":""},{"$f":"IF(Tareas!$W$1,Alumnos!C83*(30/Tareas!$W$1),\"\")","v":0},{"$f":"Alumnos!D83","v":0},{"$f":"IF(Tareas!$Y$1,Alumnos!E83*(30/Tareas!$Y$1),\"\")","v":0},{"$f":"Alumnos!F83","v":0},{"$f":"Alumnos!G83","v":0},{"$f":"Alumnos!H83","v":0},null,0,0,null,0]
[null,{"$f":"IF(Alumnos!B84<>\"\",Alumnos!B84,\"\")","v":""},{"$f":"IF(Tareas!$W$1,Alumnos!C84*(30/Tareas!$W$1),\"\")","v":0},{"$f":"Alumnos!D84","v":0},{"$f":"IF(Tareas!$Y$1,Alumnos!E84*(30/Tareas!$Y$1),\"\")","v":0},{"$f":"Alumnos!F84","v":0},{"$f":"Alumnos!G84","v":0},{"$f":"Alumnos!H84","v":0},null,0,0,null,0]
[null,{"$f":"IF(Alumnos!B85<>\"\",Alumnos!B85,\"\")","v":""},{"$f":"IF(Tareas!$W$1,Alumnos!C85*(30/Tareas!$W$1),\"\")","v":0},{"$f":"Alumnos!D85","v":0},{"$f":"IF(Tareas!$Y$1,Alumnos!E85*(30/Tareas!$Y$1),\"\")","v":0},{"$f":"Alumnos!F85","v":0},{"$f":"Alumnos!G85","v":0},{"$f":"Alumnos!H85","v":0},null,0,0,null,0]
[null,{"$f":"IF(Alumnos!B86<>\"\",Alumnos!B86,\"\")","v":""},{"$f":"IF(Tareas!$W$1,Alumnos!C86*(30/Tareas!$W$1),\"\")","v":0},{"$f":"Alumnos!D86","v":0},{"$f":"IF(Tareas!$Y$1,Alumnos!E86*(30/Tareas!$Y$1),\"\")","v":0},{"$f":"Alumnos!F86","v":0},{"$f":"Alumnos!G86","v":0},{"$f":"Alumnos!H86","v":0},null,0,0,null,0]
[null,{"$f":"IF(Alumnos!B87<>\"\",Alumnos!B87,\"\")","v":""},{"$f":"IF(Tareas!$W$1,Alumnos!C87*(30/Tareas!$W$1),\"\")","v":0},{"$f":"Alumnos!D87","v":0},{"$f":"IF(Tareas!$Y$1,Alumnos!E87*(30/Tareas!$Y$1),\"\")","v":0},{"$f":"Alumnos!F87","v":0},{"$f":"Alumnos!G87","v":0},{"$f":"Alumnos!H87","v":0},null,0,0,null,0]
[null,{"$f":"IF(Alumnos!B88<>\"\",Alumnos!B88,\"\")","v":""},{"$f":"IF(Tareas!$W$1,Alumnos!C88*(30/Tareas!$W$1),\"\")","v":0},{"$f":"Alumnos!D88","v":0},{"$f":"IF(Tareas!$Y$1,Alumnos!E88*(30/Tareas!$Y$1),\"\")","v":0},{"$f":"Alumnos!F88","v":0},{"$f":"Alumnos!G88","v":0},{"$f":"Alumnos!H88","v":0},null,0,0,null,0]
[null,{"$f":"IF(Alumnos!B89<>\"\",Alumnos!B89,\"\")","v":""},{"$f":"IF(Tareas!$W$1,Alumnos!C89*(30/Tareas!$W$1),\"\")","v":0},{"$f":"Alumnos!D89","v":0},{"$f":"IF(Tareas!$Y$1,Alumnos!E89*(30/Tareas!$Y$1),\"\")","v":0},{"$f":"Alumnos!F89","v":0},{"$f":"Alumnos!G89","v":0},{"$f":"Alumnos!H89","v":0},null,0,0,null,0]
[null,{"$f":"IF(Alumnos!B90<>\"\",Alumnos!B90,\"\")","v":""},{"$f":"IF(Tareas!$W$1,Alumnos!C90*(30/Tareas!$W$1),\"\")","v":0},{"$f":"Alumnos!D90","v":0},{"$f":"IF(Tareas!$Y$1,Alumnos!E90*(30/Tareas!$Y$1),\"\")","v":0},{"$f":"Alumnos!F90","v":0},{"$f":"Alumnos!G90","v":0},{"$f":"Alumnos!H90","v":0},null,0,0,null,0]
[null,{"$f":"IF(Alumnos!B91<>\"\",Alumnos!B91,\"\")","v":""},{"$f":"IF(Tareas!$W$1,Alumnos!C91*(30/Tareas!$W$1),\"\")","v":0},{"$f":"Alumnos!D91","v":0},{"$f":"IF(Tareas!$Y$1,Alumnos!E91*(30/Tareas!$Y$1),\"\")","v":0},{"$f":"Alumnos!F91","v":0},{"$f":"Alumnos!G91","v":0},{"$f":"Alumnos!H91","v":0},null,0,0,null,0]
[null,{"$f":"IF(Alumnos!B92<>\"\",Alumnos!B92,\"\")","v":""},{"$f":"IF(Tareas!$W$1,Alumnos!C92*(30/Tareas!$W$1),\"\")","v":0},{"$f":"Alumnos!D92","v":0},{"$f":"IF(Tareas!$Y$1,Alumnos!E92*(30/Tareas!$Y$1),\"\")","v":0},{"$f":"Alumnos!F92","v":0},{"$f":"Alumnos!G92","v":0},{"$f":"Alumnos!H92","v":0},null,0,0,null,0]
[null,{"$f":"IF(Alumnos!B93<>\"\",Alumnos!B93,\"\")","v":""},{"$f":"IF(Tareas!$W$1,Alumnos!C93*(30/Tareas!$W$1),\"\")","v":0},{"$f":"Alumnos!D93","v":0},{"$f":"IF(Tareas!$Y$1,Alumnos!E93*(30/Tareas!$Y$1),\"\")","v":0},{"$f":"Alumnos!F93","v":0},{"$f":"Alumnos!G93","v":0},{"$f":"Alumnos!H93","v":0},null,0,0,null,0]
[null,{"$f":"IF(Alumnos!B94<>\"\",Alumnos!B94,\"\")","v":""},{"$f":"IF(Tareas!$W$1,Alumnos!C94*(30/Tareas!$W$1),\"\")","v":0},{"$f":"Alumnos!D94","v":0},{"$f":"IF(Tareas!$Y$1,Alumnos!E94*(30/Tareas!$Y$1),\"\")","v":0},{"$f":"Alumnos!F94","v":0},{"$f":"Alumnos!G94","v":0},{"$f":"Alumnos!H94","v":0},null,0,0,null,0]
[null,{"$f":"IF(Alumnos!B95<>\"\",Alumnos!B95,\"\")","v":""},{"$f":"IF(Tareas!$W$1,Alumnos!C95*(30/Tareas!$W$1),\"\")","v":0},{"$f":"Alumnos!D95","v":0},{"$f":"IF(Tareas!$Y$1,Alumnos!E95*(30/Tareas!$Y$1),\"\")","v":0},{"$f":"Alumnos!F95","v":0},{"$f":"Alumnos!G95","v":0},{"$f":"Alumnos!H95","v":0},null,0,0,null,0]
[null,{"$f":"IF(Alumnos!B96<>\"\",Alumnos!B96,\"\")","v":""},{"$f":"IF(Tareas!$W$1,Alumnos!C96*(30/Tareas!$W$1),\"\")","v":0},{"$f":"Alumnos!D96","v":0},{"$f":"IF(Tareas!$Y$1,Alumnos!E96*(30/Tareas!$Y$1),\"\")","v":0},{"$f":"Alumnos!F96","v":0},{"$f":"Alumnos!G96","v":0},{"$f":"Alumnos!H96","v":0},null,0,0,null,0]
[null,{"$f":"IF(Alumnos!B97<>\"\",Alumnos!B97,\"\")","v":""},{"$f":"IF(Tareas!$W$1,Alumnos!C97*(30/Tareas!$W$1),\"\")","v":0},{"$f":"Alumnos!D97","v":0},{"$f":"IF(Tareas!$Y$1,Alumnos!E97*(30/Tareas!$Y$1),\"\")","v":0},{"$f":"Alumnos!F97","v":0},{"$f":"Alumnos!G97","v":0},{"$f":"Alumnos!H97","v":0},null,0,0,null,0]
[null,{"$f":"IF(Alumnos!B98<>\"\",Alumnos!B98,\"\")","v":""},{"$f":"IF(Tareas!$W$1,Alumnos!C98*(30/Tareas!$W$1),\"\")","v":0},{"$f":"Alumnos!D98","v":0},{"$f":"IF(Tareas!$Y$1,Alumnos!E98*(30/Tareas!$Y$1),\"\")","v":0},{"$f":"Alumnos!F98","v":0},{"$f":"Alumnos!G98","v":0},{"$f":"Alumnos!H98","v":0},null,0,0,null,0]
[null,{"$f":"IF(Alumnos!B99<>\"\",Alumnos!B99,\"\")","v":""},{"$f":"IF(Tareas!$W$1,Alumnos!C99*(30/Tareas!$W$1),\"\")","v":0},{"$f":"Alumnos!D99","v":0},{"$f":"IF(Tareas!$Y$1,Alumnos!E99*(30/Tareas!$Y$1),\"\")","v":0},{"$f":"Alumnos!F99","v":0},{"$f":"Alumnos!G99","v":0},{"$f":"Alumnos!H99","v":0},null,0,0,null,0]
[null,{"$f":"IF(Alumnos!B100<>\"\",Alumnos!B100,\"\")","v":""},{"$f":"IF(Tareas!$W$1,Alumnos!C100*(30/Tareas!$W$1),\"\")","v":0},{"$f":"Alumnos!D100","v":0},{"$f":"IF(Tareas!$Y$1,Alumnos!E100*(30/Tareas!$Y$1),\"\")","v":0},{"$f":"Alumnos!F100","v":0},{"$f":"Alumnos!G100","v":0},{"$f":"Alumnos!H100","v":0},null,0,0,null,0]
[null,{"$f":"IF(Alumnos!B101<>\"\",Alumnos!B101,\"\")","v":""},{"$f":"IF(Tareas!$W$1,Alumnos!C101*(30/Tareas!$W$1),\"\")","v":0},{"$f":"Alumnos!D101","v":0},{"$f":"IF(Tareas!$Y$1,Alumnos!E101*(30/Tareas!$Y$1),\"\")","v":0},{"$f":"Alumnos!F101","v":0},{"$f":"Alumnos!G101","v":0},{"$f":"Alumnos!H101","v":0},null,0,0,null,0]
[null,{"$f":"IF(Alumnos!B102<>\"\",Alumnos!B102,\"\")","v":""},{"$f":"IF(Tareas!$W$1,Alumnos!C102*(30/Tareas!$W$1),\"\")","v":0},{"$f":"Alumnos!D102","v":0},{"$f":"IF(Tareas!$Y$1,Alumnos!E102*(30/Tareas!$Y$1),\"\")","v":0},{"$f":"Alumnos!F102","v":0},{"$f":"Alumnos!G102","v":0},{"$f":"Alumnos!H102","v":0},null,0,0,null,0]
[null,{"$f":"IF(Alumnos!B103<>\"\",Alumnos!B103,\"\")","v":""},{"$f":"IF(Tareas!$W$1,Alumnos!C103*(30/Tareas!$W$1),\"\")","v":0},{"$f":"Alumnos!D103","v":0},{"$f":"IF(Tareas!$Y$1,Alumnos!E103*(30/Tareas!$Y$1),\"\")","v":0},{"$f":"Alumnos!F103","v":0},{"$f":"Alumnos!G103","v":0},{"$f":"Alumnos!H103","v":0},null,0,0,null,0]
[null,{"$f":"IF(Alumnos!B104<>\"\",Alumnos!B104,\"\")","v":""},{"$f":"IF(Tareas!$W$1,Alumnos!C104*(30/Tareas!$W$1),\"\")","v":0},{"$f":"Alumnos!D104","v":0},{"$f":"IF(Tareas!$Y$1,Alumnos!E104*(30/Tareas!$Y$1),\"\")","v":0},{"$f":"Alumnos!F104","v":0},{"$f":"Alumnos!G104","v":0},{"$f":"Alumnos!H104","v":0},null,0,0,null,0]
[null,{"$f":"IF(Alumnos!B105<>\"\",Alumnos!B105,\"\")","v":""},{"$f":"IF(Tareas!$W$1,Alumnos!C105*(30/Tareas!$W$1),\"\")","v":0},{"$f":"Alumnos!D105","v":0},{"$f":"IF(Tareas!$Y$1,Alumnos!E105*(30/Tareas!$Y$1),\"\")","v":0},{"$f":"Alumnos!F105","v":0},{"$f":"Alumnos!G105","v":0},{"$f":"Alumnos!H105","v":0},null,0,0,null,0]
[null,{"$f":"IF(Alumnos!B106<>\"\",Alumnos!B106,\"\")","v":""},{"$f":"IF(Tareas!$W$1,Alumnos!C106*(30/Tareas!$W$1),\"\")","v":0},{"$f":"Alumnos!D106","v":0},{"$f":"IF(Tareas!$Y$1,Alumnos!E106*(30/Tareas!$Y$1),\"\")","v":0},{"$f":"Alumnos!F106","v":0},{"$f":"Alumnos!G106","v":0},{"$f":"Alumnos!H106","v":0},null,0,0,null,0]
[null,{"$f":"IF(Alumnos!B107<>\"\",Alumnos!B107,\"\")","v":""},{"$f":"IF(Tareas!$W$1,Alumnos!C107*(30/Tareas!$W$1),\"\")","v":0},{"$f":"Alumnos!D107","v":0},{"$f":"IF(Tareas!$Y$1,Alumnos!E107*(30/Tareas!$Y$1),\"\")","v":0},{"$f":"Alumnos!F107","v":0},{"$f":"Alumnos!G107","v":0},{"$f":"Alumnos!H107","v":0},null,0,0,null,0]
[null,{"$f":"IF(Alumnos!B108<>\"\",Alumnos!B108,\"\")","v":""},{"$f":"IF(Tareas!$W$1,Alumnos!C108*(30/Tareas!$W$1),\"\")","v":0},{"$f":"Alumnos!D108","v":0},{"$f":"IF(Tareas!$Y$1,Alumnos!E108*(30/Tareas!$Y$1),\"\")","v":0},{"$f":"Alumnos!F108","v":0},{"$f":"Alumnos!G108","v":0},{"$f":"Alumnos!H108","v":0},null,0,0,null,0]
[null,{"$f":"IF(Alumnos!B109<>\"\",Alumnos!B109,\"\")","v":""},{"$f":"IF(Tareas!$W$1,Alumnos!C109*(30/Tareas!$W$1),\"\")","v":0},{"$f":"Alumnos!D109","v":0},{"$f":"IF(Tareas!$Y$1,Alumnos!E109*(30/Tareas!$Y$1),\"\")","v":0},{"$f":"Alumnos!F109","v":0},{"$f":"Alumnos!G109","v":0},{"$f":"Alumnos!H109","v":0},null,0,0,null,0]
[null,{"$f":"IF(Alumnos!B110<>\"\",Alumnos!B110,\"\")","v":""},{"$f":"IF(Tareas!$W$1,Alumnos!C110*(30/Tareas!$W$1),\"\")","v":0},{"$f":"Alumnos!D110","v":0},{"$f":"IF(Tareas!$Y$1,Alumnos!E110*(30/Tareas!$Y$1),\"\")","v":0},{"$f":"Alumnos!F110","v":0},{"$f":"Alumnos!G110","v":0},{"$f":"Alumnos!H110","v":0},null,0,0,null,0]
[null,{"$f":"IF(Alumnos!B111<>\"\",Alumnos!B111,\"\")","v":""},{"$f":"IF(Tareas!$W$1,Alumnos!C111*(30/Tareas!$W$1),\"\")","v":0},{"$f":"Alumnos!D111","v":0},{"$f":"IF(Tareas!$Y$1,Alumnos!E111*(30/Tareas!$Y$1),\"\")","v":0},{"$f":"Alumnos!F111","v":0},{"$f":"Alumnos!G111","v":0},{"$f":"Alumnos!H111","v":0},null,0,0,null,0]
[null,{"$f":"IF(Alumnos!B112<>\"\",Alumnos!B112,\"\")","v":""},{"$f":"IF(Tareas!$W$1,Alumnos!C112*(30/Tareas!$W$1),\"\")","v":0},{"$f":"Alumnos!D112","v":0},{"$f":"IF(Tareas!$Y$1,Alumnos!E112*(30/Tareas!$Y$1),\"\")","v":0},{"$f":"Alumnos!F112","v":0},{"$f":"Alumnos!G112","v":0},{"$f":"Alumnos!H112","v":0},null,0,0,null,0]
[null,{"$f":"IF(Alumnos!B113<>\"\",Alumnos!B113,\"\")","v":""},{"$f":"IF(Tareas!$W$1,Alumnos!C113*(30/Tareas!$W$1),\"\")","v":0},{"$f":"Alumnos!D113","v":0},{"$f":"IF(Tareas!$Y$1,Alumnos!E113*(30/Tareas!$Y$1),\"\")","v":0},{"$f":"Alumnos!F113","v":0},{"$f":"Alumnos!G113","v":0},{"$f":"Alumnos!H113","v":0},null,0,0,null,0]
[null,{"$f":"IF(Alumnos!B114<>\"\",Alumnos!B114,\"\")","v":""},{"$f":"IF(Tareas!$W$1,Alumnos!C114*(30/Tareas!$W$1),\"\")","v":0},{"$f":"Alumnos!D114","v":0},{"$f":"IF(Tareas!$Y$1,Alumnos!E114*(30/Tareas!$Y$1),\"\")","v":0},{"$f":"Alumnos!F114","v":0},{"$f":"Alumnos!G114","v":0},{"$f":"Alumnos!H114","v":0},null,0,0,null,0]
[null,{"$f":"IF(Alumnos!B115<>\"\",Alumnos!B115,\"\")","v":""},{"$f":"IF(Tareas!$W$1,Alumnos!C115*(30/Tareas!$W$1),\"\")","v":0},{"$f":"Alumnos!D115","v":0},{"$f":"IF(Tareas!$Y$1,Alumnos!E115*(30/Tareas!$Y$1),\"\")","v":0},{"$f":"Alumnos!F115","v":0},{"$f":"Alumnos!G115","v":0},{"$f":"Alumnos!H115","v":0},null,0,0,null,0]
[null,{"$f":"IF(Alumnos!B116<>\"\",Alumnos!B116,\"\")","v":""},{"$f":"IF(Tareas!$W$1,Alumnos!C116*(30/Tareas!$W$1),\"\")","v":0},{"$f":"Alumnos!D116","v":0},{"$f":"IF(Tareas!$Y$1,Alumnos!E116*(30/Tareas!$Y$1),\"\")","v":0},{"$f":"Alumnos!F116","v":0},{"$f":"Alumnos!G116","v":0},{"$f":"Alumnos!H116","v":0},null,0,0,null,0]
[null,{"$f":"IF(Alumnos!B117<>\"\",Alumnos!B117,\"\")","v":""},{"$f":"IF(Tareas!$W$1,Alumnos!C117*(30/Tareas!$W$1),\"\")","v":0},{"$f":"Alumnos!D117","v":0},{"$f":"IF(Tareas!$Y$1,Alumnos!E117*(30/Tareas!$Y$1),\"\")","v":0},{"$f":"Alumnos!F117","v":0},{"$f":"Alumnos!G117","v":0},{"$f":"Alumnos!H117","v":0},null,0,0,null,0]
[null,{"$f":"IF(Alumnos!B118<>\"\",Alumnos!B118,\"\")","v":""},{"$f":"IF(Tareas!$W$1,Alumnos!C118*(30/Tareas!$W$1),\"\")","v":0},{"$f":"Alumnos!D118","v":0},{"$f":"IF(Tareas!$Y$1,Alumnos!E118*(30/Tareas!$Y$1),\"\")","v":0},{"$f":"Alumnos!F118","v":0},{"$f":"Alumnos!G118","v":0},{"$f":"Alumnos!H118","v":0},null,0,0,null,0]
[null,{"$f":"IF(Alumnos!B119<>\"\",Alumnos!B119,\"\")","v":""},{"$f":"IF(Tareas!$W$1,Alumnos!C119*(30/Tareas!$W$1),\"\")","v":0},{"$f":"Alumnos!D119","v":0},{"$f":"IF(Tareas!$Y$1,Alumnos!E119*(30/Tareas!$Y$1),\"\")","v":0},{"$f":"Alumnos!F119","v":0},{"$f":"Alumnos!G119","v":0},{"$f":"Alumnos!H119","v":0},null,0,0,null,0]
[null,{"$f":"IF(Alumnos!B120<>\"\",Alumnos!B120,\"\")","v":""},{"$f":"IF(Tareas!$W$1,Alumnos!C120*(30/Tareas!$W$1),\"\")","v":0},{"$f":"Alumnos!D120","v":0},{"$f":"IF(Tareas!$Y$1,Alumnos!E120*(30/Tareas!$Y$1),\"\")","v":0},{"$f":"Alumnos!F120","v":0},{"$f":"Alumnos!G120","v":0},{"$f":"Alumnos!H120","v":0},null,0,0,null,0]
[null,{"$f":"IF(Alumnos!B121<>\"\",Alumnos!B121,\"\")","v":""},{"$f":"IF(Tareas!$W$1,Alumnos!C121*(30/Tareas!$W$1),\"\")","v":0},{"$f":"Alumnos!D121","v":0},{"$f":"IF(Tareas!$Y$1,Alumnos!E121*(30/Tareas!$Y$1),\"\")","v":0},{"$f":"Alumnos!F121","v":0},{"$f":"Alumnos!G121","v":0},{"$f":"Alumnos!H121","v":0},null,0,0,null,0]
[null,{"$f":"IF(Alumnos!B122<>\"\",Alumnos!B122,\"\")","v":""},{"$f":"IF(Tareas!$W$1,Alumnos!C122*(30/Tareas!$W$1),\"\")","v":0},{"$f":"Alumnos!D122","v":0},{"$f":"IF(Tareas!$Y$1,Alumnos!E122*(30/Tareas!$Y$1),\"\")","v":0},{"$f":"Alumnos!F122","v":0},{"$f":"Alumnos!G122","v":0},{"$f":"Alumnos!H122","v":0},null,0,0,null,0]
[null,{"$f":"IF(Alumnos!B123<>\"\",Alumnos!B123,\"\")","v":""},{"$f":"IF(Tareas!$W$1,Alumnos!C123*(30/Tareas!$W$1),\"\")","v":0},{"$f":"Alumnos!D123","v":0},{"$f":"IF(Tareas!$Y$1,Alumnos!E123*(30/Tareas!$Y$1),\"\")","v":0},{"$f":"Alumnos!F123","v":0},{"$f":"Alumnos!G123","v":0},{"$f":"Alumnos!H123","v":0},null,0,0,null,0]
[null,{"$f":"IF(Alumnos!B124<>\"\",Alumnos!B124,\"\")","v":""},{"$f":"IF(Tareas!$W$1,Alumnos!C124*(30/Tareas!$W$1),\"\")","v":0},{"$f":"Alumnos!D124","v":0},{"$f":"IF(Tareas!$Y$1,Alumnos!E124*(30/Tareas!$Y$1),\"\")","v":0},{"$f":"Alumnos!F124","v":0},{"$f":"Alumnos!G124","v":0},{"$f":"Alumnos!H124","v":0},null,0,0,null,0]
[null,{"$f":"IF(Alumnos!B125<>\"\",Alumnos!B125,\"\")","v":""},{"$f":"IF(Tareas!$W$1,Alumnos!C125*(30/Tareas!$W$1),\"\")","v":0},{"$f":"Alumnos!D125","v":0},{"$f":"IF(Tareas!$Y$1,Alumnos!E125*(30/Tareas!$Y$1),\"\")","v":0},{"$f":"Alumnos!F125","v":0},{"$f":"Alumnos!G125","v":0},{"$f":"Alumnos!H125","v":0},null,0,0,null,0]
[null,{"$f":"IF(Alumnos!B126<>\"\",Alumnos!B126,\"\")","v":""},{"$f":"IF(Tareas!$W$1,Alumnos!C126*(30/Tareas!$W$1),\"\")","v":0},{"$f":"Alumnos!D126","v":0},{"$f":"IF(Tareas!$Y$1,Alumnos!E126*(30/Tareas!$Y$1),\"\")","v":0},{"$f":"Alumnos!F126","v":0},{"$f":"Alumnos!G126","v":0},{"$f":"Alumnos!H126","v":0},null,0,0,null,0]
[null,{"$f":"IF(Alumnos!B127<>\"\",Alumnos!B127,\"\")","v":""},{"$f":"IF(Tareas!$W$1,Alumnos!C127*(30/Tareas!$W$1),\"\")","v":0},{"$f":"Alumnos!D127","v":0},{"$f":"IF(Tareas!$Y$1,Alumnos!E127*(30/Tareas!$Y$1),\"\")","v":0},{"$f":"Alumnos!F127","v":0},{"$f":"Alumnos!G127","v":0},{"$f":"Alumnos!H127","v":0},null,0,0,null,0]
[null,{"$f":"IF(Alumnos!B128<>\"\",Alumnos!B128,\"\")","v":""},{"$f":"IF(Tareas!$W$1,Alumnos!C128*(30/Tareas!$W$1),\"\")","v":0},{"$f":"Alumnos!D128","v":0},{"$f":"IF(Tareas!$Y$1,Alumnos!E128*(30/Tareas!$Y$1),\"\")","v":0},{"$f":"Alumnos!F128","v":0},{"$f":"Alumnos!G128","v":0},{"$f":"Alumnos!H128","v":0},null,0,0,null,0]
[null,{"$f":"IF(Alumnos!B129<>\"\",Alumnos!B129,\"\")","v":""},{"$f":"IF(Tareas!$W$1,Alumnos!C129*(30/Tareas!$W$1),\"\")","v":0},{"$f":"Alumnos!D129","v":0},{"$f":"IF(Tareas!$Y$1,Alumnos!E129*(30/Tareas!$Y$1),\"\")","v":0},{"$f":"Alumnos!F129","v":0},{"$f":"Alumnos!G129","v":0},{"$f":"Alumnos!H129","v":0},null,0,0,null,0]
[null,{"$f":"IF(Alumnos!B130<>\"\",Alumnos!B130,\"\")","v":""},{"$f":"IF(Tareas!$W$1,Alumnos!C130*(30/Tareas!$W$1),\"\")","v":0},{"$f":"Alumnos!D130","v":0},{"$f":"IF(Tareas!$Y$1,Alumnos!E130*(30/Tareas!$Y$1),\"\")","v":0},{"$f":"Alumnos!F130","v":0},{"$f":"Alumnos!G130","v":0},{"$f":"Alumnos!H130","v":0},null,0,0,null,0]
[null,{"$f":"IF(Alumnos!B131<>\"\",Alumnos!B131,\"\")","v":""},{"$f":"IF(Tareas!$W$1,Alumnos!C131*(30/Tareas!$W$1),\"\")","v":0},{"$f":"Alumnos!D131","v":0},{"$f":"IF(Tareas!$Y$1,Alumnos!E131*(30/Tareas!$Y$1),\"\")","v":0},{"$f":"Alumnos!F131","v":0},{"$f":"Alumnos!G131","v":0},{"$f":"Alumnos!H131","v":0},null,{"$f":"SUM(C131:F131)","v":0},{"$f":"SUM(G131:H131)","v":0},null,{"$f":"(J131+K131)/2","v":0}]
[null,{"$f":"IF(Alumnos!B132<>\"\",Alumnos!B132,\"\")","v":""},{"$f":"IF(Tareas!$W$1,Alumnos!C132*(30/Tareas!$W$1),\"\")","v":0},{"$f":"Alumnos!D132","v":0},{"$f":"IF(Tareas!$Y$1,Alumnos!E132*(30/Tareas!$Y$1),\"\")","v":0},{"$f":"Alumnos!F132","v":0},{"$f":"Alumnos!G132","v":0},{"$f":"Alumnos!H132","v":0},null,0,0,null,0]
[null,{"$f":"IF(Alumnos!B133<>\"\",Alumnos!B133,\"\")","v":""},{"$f":"IF(Tareas!$W$1,Alumnos!C133*(30/Tareas!$W$1),\"\")","v":0},{"$f":"Alumnos!D133","v":0},{"$f":"IF(Tareas!$Y$1,Alumnos!E133*(30/Tareas!$Y$1),\"\")","v":0},{"$f":"Alumnos!F133","v":0},{"$f":"Alumnos!G133","v":0},{"$f":"Alumnos!H133","v":0},null,0,0,null,0]
[null,{"$f":"IF(Alumnos!B134<>\"\",Alumnos!B134,\"\")","v":""},{"$f":"IF(Tareas!$W$1,Alumnos!C134*(30/Tareas!$W$1),\"\")","v":0},{"$f":"Alumnos!D134","v":0},{"$f":"IF(Tareas!$Y$1,Alumnos!E134*(30/Tareas!$Y$1),\"\")","v":0},{"$f":"Alumnos!F134","v":0},{"$f":"Alumnos!G134","v":0},{"$f":"Alumnos!H134","v":0},null,0,0,null,0]
[null,{"$f":"IF(Alumnos!B135<>\"\",Alumnos!B135,\"\")","v":""},{"$f":"IF(Tareas!$W$1,Alumnos!C135*(30/Tareas!$W$1),\"\")","v":0},{"$f":"Alumnos!D135","v":0},{"$f":"IF(Tareas!$Y$1,Alumnos!E135*(30/Tareas!$Y$1),\"\")","v":0},{"$f":"Alumnos!F135","v":0},{"$f":"Alumnos!G135","v":0},{"$f":"Alumnos!H135","v":0},null,0,0,null,0]
[null,{"$f":"IF(Alumnos!B136<>\"\",Alumnos!B136,\"\")","v":""},{"$f":"IF(Tareas!$W$1,Alumnos!C136*(30/Tareas!$W$1),\"\")","v":0},{"$f":"Alumnos!D136","v":0},{"$f":"IF(Tareas!$Y$1,Alumnos!E136*(30/Tareas!$Y$1),\"\")","v":0},{"$f":"Alumnos!F136","v":0},{"$f":"Alumnos!G136","v":0},{"$f":"Alumnos!H136","v":0},null,0,0,null,0]
[null,{"$f":"IF(Alumnos!B137<>\"\",Alumnos!B137,\"\")","v":""},{"$f":"IF(Tareas!$W$1,Alumnos!C137*(30/Tareas!$W$1),\"\")","v":0},{"$f":"Alumnos!D137","v":0},{"$f":"IF(Tareas!$Y$1,Alumnos!E137*(30/Tareas!$Y$1),\"\")","v":0},{"$f":"Alumnos!F137","v":0},{"$f":"Alumnos!G137","v":0},{"$f":"Alumnos!H137","v":0},null,0,0,null,0]
[null,{"$f":"IF(Alumnos!B138<>\"\",Alumnos!B138,\"\")","v":""},{"$f":"IF(Tareas!$W$1,Alumnos!C138*(30/Tareas!$W$1),\"\")","v":0},{"$f":"Alumnos!D138","v":0},{"$f":"IF(Tareas!$Y$1,Alumnos!E138*(30/Tareas!$Y$1),\"\")","v":0},{"$f":"Alumnos!F138","v":0},{"$f":"Alumnos!G138","v":0},{"$f":"Alumnos!H138","v":0},null,0,0,null,0]
[null,{"$f":"IF(Alumnos!B139<>\"\",Alumnos!B139,\"\")","v":""},{"$f":"IF(Tareas!$W$1,Alumnos!C139*(30/Tareas!$W$1),\"\")","v":0},{"$f":"Alumnos!D139","v":0},{"$f":"IF(Tareas!$Y$1,Alumnos!E139*(30/Tareas!$Y$1),\"\")","v":0},{"$f":"Alumnos!F139","v":0},{"$f":"Alumnos!G139","v":0},{"$f":"Alumnos!H139","v":0},null,0,0,null,0]
[null,{"$f":"IF(Alumnos!B140<>\"\",Alumnos!B140,\"\")","v":""},{"$f":"IF(Tareas!$W$1,Alumnos!C140*(30/Tareas!$W$1),\"\")","v":0},{"$f":"Alumnos!D140","v":0},{"$f":"IF(Tareas!$Y$1,Alumnos!E140*(30/Tareas!$Y$1),\"\")","v":0},{"$f":"Alumnos!F140","v":0},{"$f":"Alumnos!G140","v":0},{"$f":"Alumnos!H140","v":0},null,0,0,null,0]
[null,{"$f":"IF(Alumnos!B141<>\"\",Alumnos!B141,\"\")","v":""},{"$f":"IF(Tareas!$W$1,Alumnos!C141*(30/Tareas!$W$1),\"\")","v":0},{"$f":"Alumnos!D141","v":0},{"$f":"IF(Tareas!$Y$1,Alumnos!E141*(30/Tareas!$Y$1),\"\")","v":0},{"$f":"Alumnos!F141","v":0},{"$f":"Alumnos!G141","v":0},{"$f":"Alumnos!H141","v":0},null,0,0,null,0]
[null,{"$f":"IF(Alumnos!B142<>\"\",Alumnos!B142,\"\")","v":""},{"$f":"IF(Tareas!$W$1,Alumnos!C142*(30/Tareas!$W$1),\"\")","v":0},{"$f":"Alumnos!D142","v":0},{"$f":"IF(Tareas!$Y$1,Alumnos!E142*(30/Tareas!$Y$1),\"\")","v":0},{"$f":"Alumnos!F142","v":0},{"$f":"Alumnos!G142","v":0},{"$f":"Alumnos!H142","v":0},null,0,0,null,0]
[null,{"$f":"IF(Alumnos!B143<>\"\",Alumnos!B143,\"\")","v":""},{"$f":"IF(Tareas!$W$1,Alumnos!C143*(30/Tareas!$W$1),\"\")","v":0},{"$f":"Alumnos!D143","v":0},{"$f":"IF(Tareas!$Y$1,Alumnos!E143*(30/Tareas!$Y$1),\"\")","v":0},{"$f":"Alumnos!F143","v":0},{"$f":"Alumnos!G143","v":0},{"$f":"Alumnos!H143","v":0},null,0,0,null,0]
[null,{"$f":"IF(Alumnos!B144<>\"\",Alumnos!B144,\"\")","v":""},{"$f":"IF(Tareas!$W$1,Alumnos!C144*(30/Tareas!$W$1),\"\")","v":0},{"$f":"Alumnos!D144","v":0},{"$f":"IF(Tareas!$Y$1,Alumnos!E144*(30/Tareas!$Y$1),\"\")","v":0},{"$f":"Alumnos!F144","v":0},{"$f":"Alumnos!G144","v":0},{"$f":"Alumnos!H144","v":0},null,0,0,null,0]
[null,{"$f":"IF(Alumnos!B145<>\"\",Alumnos!B145,\"\")","v":""},{"$f":"IF(Tareas!$W$1,Alumnos!C145*(30/Tareas!$W$1),\"\")","v":0},{"$f":"Alumnos!D145","v":0},{"$f":"IF(Tareas!$Y$1,Alumnos!E145*(30/Tareas!$Y$1),\"\")","v":0},{"$f":"Alumnos!F145","v":0},{"$f":"Alumnos!G145","v":0},{"$f":"Alumnos!H145","v":0},null,0,0,null,0]
[null,{"$f":"IF(Alumnos!B146<>\"\",Alumnos!B146,\"\")","v":""},{"$f":"IF(Tareas!$W$1,Alumnos!C146*(30/Tareas!$W$1),\"\")","v":0},{"$f":"Alumnos!D146","v":0},{"$f":"IF(Tareas!$Y$1,Alumnos!E146*(30/Tareas!$Y$1),\"\")","v":0},{"$f":"Alumnos!F146","v":0},{"$f":"Alumnos!G146","v":0},{"$f":"Alumnos!H146","v":0},null,0,0,null,0]
[null,{"$f":"IF(Alumnos!B147<>\"\",Alumnos!B147,\"\")","v":""},{"$f":"IF(Tareas!$W$1,Alumnos!C147*(30/Tareas!$W$1),\"\")","v":0},{"$f":"Alumnos!D147","v":0},{"$f":"IF(Tareas!$Y$1,Alumnos!E147*(30/Tareas!$Y$1),\"\")","v":0},{"$f":"Alumnos!F147","v":0},{"$f":"Alumnos!G147","v":0},{"$f":"Alumnos!H147","v":0},null,0,0,null,0]
[null,{"$f":"IF(Alumnos!B148<>\"\",Alumnos!B148,\"\")","v":""},{"$f":"IF(Tareas!$W$1,Alumnos!C148*(30/Tareas!$W$1),\"\")","v":0},{"$f":"Alumnos!D148","v":0},{"$f":"IF(Tareas!$Y$1,Alumnos!E148*(30/Tareas!$Y$1),\"\")","v":0},{"$f":"Alumnos!F148","v":0},{"$f":"Alumnos!G148","v":0},{"$f":"Alumnos!H148","v":0},null,0,0,null,0]
[null,{"$f":"IF(Alumnos!B149<>\"\",Alumnos!B149,\"\")","v":""},{"$f":"IF(Tareas!$W$1,Alumnos!C149*(30/Tareas!$W$1),\"\")","v":0},{"$f":"Alumnos!D149","v":0},{"$f":"IF(Tareas!$Y$1,Alumnos!E149*(30/Tareas!$Y$1),\"\")","v":0},{"$f":"Alumnos!F149","v":0},{"$f":"Alumnos!G149","v":0},{"$f":"Alumnos!H149","v":0},null,0,0,null,0]
[null,{"$f":"IF(Alumnos!B150<>\"\",Alumnos!B150,\"\")","v":""},{"$f":"IF(Tareas!$W$1,Alumnos!C150*(30/Tareas!$W$1),\"\")","v":0},{"$f":"Alumnos!D150","v":0},{"$f":"IF(Tareas!$Y$1,Alumnos!E150*(30/Tareas!$Y$1),\"\")","v":0},{"$f":"Alumnos!F150","v":0},{"$f":"Alumnos!G150","v":0},{"$f":"Alumnos!H150","v":0},null,0,0,null,0]
[null,{"$f":"IF(Alumnos!B151<>\"\",Alumnos!B151,\"\")","v":""},{"$f":"IF(Tareas!$W$1,Alumnos!C151*(30/Tareas!$W$1),\"\")","v":0},{"$f":"Alumnos!D151","v":0},{"$f":"IF(Tareas!$Y$1,Alumnos!E151*(30/Tareas!$Y$1),\"\")","v":0},{"$f":"Alumnos!F151","v":0},{"$f":"Alumnos!G151","v":0},{"$f":"Alumnos!H151","v":0},null,0,0,null,0]
[null,{"$f":"IF(Alumnos!B152<>\"\",Alumnos!B152,\"\")","v":""},{"$f":"IF(Tareas!$W$1,Alumnos!C152*(30/Tareas!$W$1),\"\")","v":0},{"$f":"Alumnos!D152","v":0},{"$f":"IF(Tareas!$Y$1,Alumnos!E152*(30/Tareas!$Y$1),\"\")","v":0},{"$f":"Alumnos!F152","v":0},{"$f":"Alumnos!G152","v":0},{"$f":"Alumnos!H152","v":0},null,0,0,null,0]
[null,{"$f":"IF(Alumnos!B153<>\"\",Alumnos!B153,\"\")","v":""},{"$f":"IF(Tareas!$W$1,Alumnos!C153*(30/Tareas!$W$1),\"\")","v":0},{"$f":"Alumnos!D153","v":0},{"$f":"IF(Tareas!$Y$1,Alumnos!E153*(30/Tareas!$Y$1),\"\")","v":0},{"$f":"Alumnos!F153","v":0},{"$f":"Alumnos!G153","v":0},{"$f":"Alumnos!H153","v":0},null,0,0,null,0]
[null,{"$f":"IF(Alumnos!B154<>\"\",Alumnos!B154,\"\")","v":""},{"$f":"IF(Tareas!$W$1,Alumnos!C154*(30/Tareas!$W$1),\"\")","v":0},{"$f":"Alumnos!D154","v":0},{"$f":"IF(Tareas!$Y$1,Alumnos!E154*(30/Tareas!$Y$1),\"\")","v":0},{"$f":"Alumnos!F154","v":0},{"$f":"Alumnos!G154","v":0},{"$f":"Alumnos!H154","v":0},null,0,0,null,0]
[null,{"$f":"IF(Alumnos!B155<>\"\",Alumnos!B155,\"\")","v":""},{"$f":"IF(Tareas!$W$1,Alumnos!C155*(30/Tareas!$W$1),\"\")","v":0},{"$f":"Alumnos!D155","v":0},{"$f":"IF(Tareas!$Y$1,Alumnos!E155*(30/Tareas!$Y$1),\"\")","v":0},{"$f":"Alumnos!F155","v":0},{"$f":"Alumnos!G155","v":0},{"$f":"Alumnos!H155","v":0},null,0,0,null,0]
[null,{"$f":"IF(Alumnos!B156<>\"\",Alumnos!B156,\"\")","v":""},{"$f":"IF(Tareas!$W$1,Alumnos!C156*(30/Tareas!$W$1),\"\")","v":0},{"$f":"Alumnos!D156","v":0},{"$f":"IF(Tareas!$Y$1,Alumnos!E156*(30/Tareas!$Y$1),\"\")","v":0},{"$f":"Alumnos!F156","v":0},{"$f":"Alumnos!G156","v":0},{"$f":"Alumnos!H156","v":0},null,0,0,null,0]
[null,{"$f":"IF(Alumnos!B157<>\"\",Alumnos!B157,\"\")","v":""},{"$f":"IF(Tareas!$W$1,Alumnos!C157*(30/Tareas!$W$1),\"\")","v":0},{"$f":"Alumnos!D157","v":0},{"$f":"IF(Tareas!$Y$1,Alumnos!E157*(30/Tareas!$Y$1),\"\")","v":0},{"$f":"Alumnos!F157","v":0},{"$f":"Alumnos!G157","v":0},{"$f":"Alumnos!H157","v":0},null,0,0,null,0]
[null,{"$f":"IF(Alumnos!B158<>\"\",Alumnos!B158,\"\")","v":""},{"$f":"IF(Tareas!$W$1,Alumnos!C158*(30/Tareas!$W$1),\"\")","v":0},{"$f":"Alumnos!D158","v":0},{"$f":"IF(Tareas!$Y$1,Alumnos!E158*(30/Tareas!$Y$1),\"\")","v":0},{"$f":"Alumnos!F158","v":0},{"$f":"Alumnos!G158","v":0},{"$f":"Alumnos!H158","v":0},null,0,0,null,0]
[null,{"$f":"IF(Alumnos!B159<>\"\",Alumnos!B159,\"\")","v":""},{"$f":"IF(Tareas!$W$1,Alumnos!C159*(30/Tareas!$W$1),\"\")","v":0},{"$f":"Alumnos!D159","v":0},{"$f":"IF(Tareas!$Y$1,Alumnos!E159*(30/Tareas!$Y$1),\"\")","v":0},{"$f":"Alumnos!F159","v":0},{"$f":"Alumnos!G159","v":0},{"$f":"Alumnos!H159","v":0},null,0,0,null,0]
[null,{"$f":"IF(Alumnos!B160<>\"\",Alumnos!B160,\"\")","v":""},{"$f":"IF(Tareas!$W$1,Alumnos!C160*(30/Tareas!$W$1),\"\")","v":0},{"$f":"Alumnos!D160","v":0},{"$f":"IF(Tareas!$Y$1,Alumnos!E160*(30/Tareas!$Y$1),\"\")","v":0},{"$f":"Alumnos!F160","v":0},{"$f":"Alumnos!G160","v":0},{"$f":"Alumnos!H160","v":0},null,0,0,null,0]
[null,{"$f":"IF(Alumnos!B161<>\"\",Alumnos!B161,\"\")","v":""},{"$f":"IF(Tareas!$W$1,Alumnos!C161*(30/Tareas!$W$1),\"\")","v":0},{"$f":"Alumnos!D161","v":0},{"$f":"IF(Tareas!$Y$1,Alumnos!E161*(30/Tareas!$Y$1),\"\")","v":0},{"$f":"Alumnos!F161","v":0},{"$f":"Alumnos!G161","v":0},{"$f":"Alumnos!H161","v":0},null,0,0,null,0]
[null,{"$f":"IF(Alumnos!B162<>\"\",Alumnos!B162,\"\")","v":""},{"$f":"IF(Tareas!$W$1,Alumnos!C162*(30/Tareas!$W$1),\"\")","v":0},{"$f":"Alumnos!D162","v":0},{"$f":"IF(Tareas!$Y$1,Alumnos!E162*(30/Tareas!$Y$1),\"\")","v":0},{"$f":"Alumnos!F162","v":0},{"$f":"Alumnos!G162","v":0},{"$f":"Alumnos!H162","v":0},null,0,0,null,0]
[null,{"$f":"IF(Alumnos!B163<>\"\",Alumnos!B163,\"\")","v":""},{"$f":"IF(Tareas!$W$1,Alumnos!C163*(30/Tareas!$W$1),\"\")","v":0},{"$f":"Alumnos!D163","v":0},{"$f":"IF(Tareas!$Y$1,Alumnos!E163*(30/Tareas!$Y$1),\"\")","v":0},{"$f":"Alumnos!F163","v":0},{"$f":"Alumnos!G163","v":0},{"$f":"Alumnos!H163","v":0},null,0,0,null,0]
[null,{"$f":"IF(Alumnos!B164<>\"\",Alumnos!B164,\"\")","v":""},{"$f":"IF(Tareas!$W$1,Alumnos!C164*(30/Tareas!$W$1),\"\")","v":0},{"$f":"Alumnos!D164","v":0},{"$f":"IF(Tareas!$Y$1,Alumnos!E164*(30/Tareas!$Y$1),\"\")","v":0},{"$f":"Alumnos!F164","v":0},{"$f":"Alumnos!G164","v":0},{"$f":"Alumnos!H164","v":0},null,0,0,null,0]
[null,{"$f":"IF(Alumnos!B165<>\"\",Alumnos!B165,\"\")","v":""},{"$f":"IF(Tareas!$W$1,Alumnos!C165*(30/Tareas!$W$1),\"\")","v":0},{"$f":"Alumnos!D165","v":0},{"$f":"IF(Tareas!$Y$1,Alumnos!E165*(30/Tareas!$Y$1),\"\")","v":0},{"$f":"Alumnos!F165","v":0},{"$f":"Alumnos!G165","v":0},{"$f":"Alumnos!H165","v":0},null,0,0,null,0]
[null,{"$f":"IF(Alumnos!B166<>\"\",Alumnos!B166,\"\")","v":""},{"$f":"IF(Tareas!$W$1,Alumnos!C166*(30/Tareas!$W$1),\"\")","v":0},{"$f":"Alumnos!D166","v":0},{"$f":"IF(Tareas!$Y$1,Alumnos!E166*(30/Tareas!$Y$1),\"\")","v":0},{"$f":"Alumnos!F166","v":0},{"$f":"Alumnos!G166","v":0},{"$f":"Alumnos!H166","v":0},null,0,0,null,0]
[null,{"$f":"IF(Alumnos!B167<>\"\",Alumnos!B167,\"\")","v":""},{"$f":"IF(Tareas!$W$1,Alumnos!C167*(30/Tareas!$W$1),\"\")","v":0},{"$f":"Alumnos!D167","v":0},{"$f":"IF(Tareas!$Y$1,Alumnos!E167*(30/Tareas!$Y$1),\"\")","v":0},{"$f":"Alumnos!F167","v":0},{"$f":"Alumnos!G167","v":0},{"$f":"Alumnos!H167","v":0},null,0,0,null,0]
[null,{"$f":"IF(Alumnos!B168<>\"\",Alumnos!B168,\"\")","v":""},{"$f":"IF(Tareas!$W$1,Alumnos!C168*(30/Tareas!$W$1),\"\")","v":0},{"$f":"Alumnos!D168","v":0},{"$f":"IF(Tareas!$Y$1,Alumnos!E168*(30/Tareas!$Y$1),\"\")","v":0},{"$f":"Alumnos!F168","v":0},{"$f":"Alumnos!G168","v":0},{"$f":"Alumnos!H168","v":0},null,0,0,null,0]
[null,{"$f":"IF(Alumnos!B169<>\"\",Alumnos!B169,\"\")","v":""},{"$f":"IF(Tareas!$W$1,Alumnos!C169*(30/Tareas!$W$1),\"\")","v":0},{"$f":"Alumnos!D169","v":0},{"$f":"IF(Tareas!$Y$1,Alumnos!E169*(30/Tareas!$Y$1),\"\")","v":0},{"$f":"Alumnos!F169","v":0},{"$f":"Alumnos!G169","v":0},{"$f":"Alumnos!H169","v":0},null,0,0,null,0]
[null,{"$f":"IF(Alumnos!B170<>\"\",Alumnos!B170,\"\")","v":""},{"$f":"IF(Tareas!$W$1,Alumnos!C170*(30/Tareas!$W$1),\"\")","v":0},{"$f":"Alumnos!D170","v":0},{"$f":"IF(Tareas!$Y$1,Alumnos!E170*(30/Tareas!$Y$1),\"\")","v":0},{"$f":"Alumnos!F170","v":0},{"$f":"Alumnos!G170","v":0},{"$f":"Alumnos!H170","v":0},null,0,0,null,0]
[null,{"$f":"IF(Alumnos!B171<>\"\",Alumnos!B171,\"\")","v":""},{"$f":"IF(Tareas!$W$1,Alumnos!C171*(30/Tareas!$W$1),\"\")","v":0},{"$f":"Alumnos!D171","v":0},{"$f":"IF(Tareas!$Y$1,Alumnos!E171*(30/Tareas!$Y$1),\"\")","v":0},{"$f":"Alumnos!F171","v":0},{"$f":"Alumnos!G171","v":0},{"$f":"Alumnos!H171","v":0},null,0,0,null,0]
[null,{"$f":"IF(Alumnos!B172<>\"\",Alumnos!B172,\"\")","v":""},{"$f":"IF(Tareas!$W$1,Alumnos!C172*(30/Tareas!$W$1),\"\")","v":0},{"$f":"Alumnos!D172","v":0},{"$f":"IF(Tareas!$Y$1,Alumnos!E172*(30/Tareas!$Y$1),\"\")","v":0},{"$f":"Alumnos!F172","v":0},{"$f":"Alumnos!G172","v":0},{"$f":"Alumnos!H172","v":0},null,0,0,null,0]
[null,{"$f":"IF(Alumnos!B173<>\"\",Alumnos!B173,\"\")","v":""},{"$f":"IF(Tareas!$W$1,Alumnos!C173*(30/Tareas!$W$1),\"\")","v":0},{"$f":"Alumnos!D173","v":0},{"$f":"IF(Tareas!$Y$1,Alumnos!E173*(30/Tareas!$Y$1),\"\")","v":0},{"$f":"Alumnos!F173","v":0},{"$f":"Alumnos!G173","v":0},{"$f":"Alumnos!H173","v":0},null,0,0,null,0]
[null,{"$f":"IF(Alumnos!B174<>\"\",Alumnos!B174,\"\")","v":""},{"$f":"IF(Tareas!$W$1,Alumnos!C174*(30/Tareas!$W$1),\"\")","v":0},{"$f":"Alumnos!D174","v":0},{"$f":"IF(Tareas!$Y$1,Alumnos!E174*(30/Tareas!$Y$1),\"\")","v":0},{"$f":"Alumnos!F174","v":0},{"$f":"Alumnos!G174","v":0},{"$f":"Alumnos!H174","v":0},null,0,0,null,0]
[null,{"$f":"IF(Alumnos!B175<>\"\",Alumnos!B175,\"\")","v":""},{"$f":"IF(Tareas!$W$1,Alumnos!C175*(30/Tareas!$W$1),\"\")","v":0},{"$f":"Alumnos!D175","v":0},{"$f":"IF(Tareas!$Y$1,Alumnos!E175*(30/Tareas!$Y$1),\"\")","v":0},{"$f":"Alumnos!F175","v":0},{"$f":"Alumnos!G175","v":0},{"$f":"Alumnos!H175","v":0},null,0,0,null,0]
[null,{"$f":"IF(Alumnos!B176<>\"\",Alumnos!B176,\"\")","v":""},{"$f":"IF(Tareas!$W$1,Alumnos!C176*(30/Tareas!$W$1),\"\")","v":0},{"$f":"Alumnos!D176","v":0},{"$f":"IF(Tareas!$Y$1,Alumnos!E176*(30/Tareas!$Y$1),\"\")","v":0},{"$f":"Alumnos!F176","v":0},{"$f":"Alumnos!G176","v":0},{"$f":"Alumnos!H176","v":0},null,0,0,null,0]
[null,{"$f":"IF(Alumnos!B177<>\"\",Alumnos!B177,\"\")","v":""},{"$f":"IF(Tareas!$W$1,Alumnos!C177*(30/Tareas!$W$1),\"\")","v":0},{"$f":"Alumnos!D177","v":0},{"$f":"IF(Tareas!$Y$1,Alumnos!E177*(30/Tareas!$Y$1),\"\")","v":0},{"$f":"Alumnos!F177","v":0},{"$f":"Alumnos!G177","v":0},{"$f":"Alumnos!H177","v":0},null,0,0,null,0]
[null,{"$f":"IF(Alumnos!B178<>\"\",Alumnos!B178,\"\")","v":""},{"$f":"IF(Tareas!$W$1,Alumnos!C178*(30/Tareas!$W$1),\"\")","v":0},{"$f":"Alumnos!D178","v":0},{"$f":"IF(Tareas!$Y$1,Alumnos!E178*(30/Tareas!$Y$1),\"\")","v":0},{"$f":"Alumnos!F178","v":0},{"$f":"Alumnos!G178","v":0},{"$f":"Alumnos!H178","v":0},null,0,0,null,0]
[null,{"$f":"IF(Alumnos!B179<>\"\",Alumnos!B179,\"\")","v":""},{"$f":"IF(Tareas!$W$1,Alumnos!C179*(30/Tareas!$W$1),\"\")","v":0},{"$f":"Alumnos!D179","v":0},{"$f":"IF(Tareas!$Y$1,Alumnos!E179*(30/Tareas!$Y$1),\"\")","v":0},{"$f":"Alumnos!F179","v":0},{"$f":"Alumnos!G179","v":0},{"$f":"Alumnos!H179","v":0},null,0,0,null,0]
[null,{"$f":"IF(Alumnos!B180<>\"\",Alumnos!B180,\"\")","v":""},{"$f":"IF(Tareas!$W$1,Alumnos!C180*(30/Tareas!$W$1),\"\")","v":0},{"$f":"Alumnos!D180","v":0},{"$f":"IF(Tareas!$Y$1,Alumnos!E180*(30/Tareas!$Y$1),\"\")","v":0},{"$f":"Alumnos!F180","v":0},{"$f":"Alumnos!G180","v":0},{"$f":"Alumnos!H180","v":0},null,0,0,null,0]
[null,{"$f":"IF(Alumnos!B181<>\"\",Alumnos!B181,\"\")","v":""},{"$f":"IF(Tareas!$W$1,Alumnos!C181*(30/Tareas!$W$1),\"\")","v":0},{"$f":"Alumnos!D181","v":0},{"$f":"IF(Tareas!$Y$1,Alumnos!E181*(30/Tareas!$Y$1),\"\")","v":0},{"$f":"Alumnos!F181","v":0},{"$f":"Alumnos!G181","v":0},{"$f":"Alumnos!H181","v":0},null,0,0,null,0]
[null,{"$f":"IF(Alumnos!B182<>\"\",Alumnos!B182,\"\")","v":""},{"$f":"IF(Tareas!$W$1,Alumnos!C182*(30/Tareas!$W$1),\"\")","v":0},{"$f":"Alumnos!D182","v":0},{"$f":"IF(Tareas!$Y$1,Alumnos!E182*(30/Tareas!$Y$1),\"\")","v":0},{"$f":"Alumnos!F182","v":0},{"$f":"Alumnos!G182","v":0},{"$f":"Alumnos!H182","v":0},null,0,0,null,0]
[null,{"$f":"IF(Alumnos!B183<>\"\",Alumnos!B183,\"\")","v":""},{"$f":"IF(Tareas!$W$1,Alumnos!C183*(30/Tareas!$W$1),\"\")","v":0},{"$f":"Alumnos!D183","v":0},{"$f":"IF(Tareas!$Y$1,Alumnos!E183*(30/Tareas!$Y$1),\"\")","v":0},{"$f":"Alumnos!F183","v":0},{"$f":"Alumnos!G183","v":0},{"$f":"Alumnos!H183","v":0},null,0,0,null,0]
[null,{"$f":"IF(Alumnos!B184<>\"\",Alumnos!B184,\"\")","v":""},{"$f":"IF(Tareas!$W$1,Alumnos!C184*(30/Tareas!$W$1),\"\")","v":0},{"$f":"Alumnos!D184","v":0},{"$f":"IF(Tareas!$Y$1,Alumnos!E184*(30/Tareas!$Y$1),\"\")","v":0},{"$f":"Alumnos!F184","v":0},{"$f":"Alumnos!G184","v":0},{"$f":"Alumnos!H184","v":0},null,0,0,null,0]
[null,{"$f":"IF(Alumnos!B185<>\"\",Alumnos!B185,\"\")","v":""},{"$f":"IF(Tareas!$W$1,Alumnos!C185*(30/Tareas!$W$1),\"\")","v":0},{"$f":"Alumnos!D185","v":0},{"$f":"IF(Tareas!$Y$1,Alumnos!E185*(30/Tareas!$Y$1),\"\")","v":0},{"$f":"Alumnos!F185","v":0},{"$f":"Alumnos!G185","v":0},{"$f":"Alumnos!H185","v":0},null,0,0,null,0]
[null,{"$f":"IF(Alumnos!B186<>\"\",Alumnos!B186,\"\")","v":""},{"$f":"IF(Tareas!$W$1,Alumnos!C186*(30/Tareas!$W$1),\"\")","v":0},{"$f":"Alumnos!D186","v":0},{"$f":"IF(Tareas!$Y$1,Alumnos!E186*(30/Tareas!$Y$1),\"\")","v":0},{"$f":"Alumnos!F186","v":0},{"$f":"Alumnos!G186","v":0},{"$f":"Alumnos!H186","v":0},null,0,0,null,0]
[null,{"$f":"IF(Alumnos!B187<>\"\",Alumnos!B187,\"\")","v":""},{"$f":"IF(Tareas!$W$1,Alumnos!C187*(30/Tareas!$W$1),\"\")","v":0},{"$f":"Alumnos!D187","v":0},{"$f":"IF(Tareas!$Y$1,Alumnos!E187*(30/Tareas!$Y$1),\"\")","v":0},{"$f":"Alumnos!F187","v":0},{"$f":"Alumnos!G187","v":0},{"$f":"Alumnos!H187","v":0},null,0,0,null,0]
[null,{"$f":"IF(Alumnos!B188<>\"\",Alumnos!B188,\"\")","v":""},{"$f":"IF(Tareas!$W$1,Alumnos!C188*(30/Tareas!$W$1),\"\")","v":0},{"$f":"Alumnos!D188","v":0},{"$f":"IF(Tareas!$Y$1,Alumnos!E188*(30/Tareas!$Y$1),\"\")","v":0},{"$f":"Alumnos!F188","v":0},{"$f":"Alumnos!G188","v":0},{"$f":"Alumnos!H188","v":0},null,0,0,null,0]
[null,{"$f":"IF(Alumnos!B189<>\"\",Alumnos!B189,\"\")","v":""},{"$f":"IF(Tareas!$W$1,Alumnos!C189*(30/Tareas!$W$1),\"\")","v":0},{"$f":"Alumnos!D189","v":0},{"$f":"IF(Tareas!$Y$1,Alumnos!E189*(30/Tareas!$Y$1),\"\")","v":0},{"$f":"Alumnos!F189","v":0},{"$f":"Alumnos!G189","v":0},{"$f":"Alumnos!H189","v":0},null,0,0,null,0]
[null,{"$f":"IF(Alumnos!B190<>\"\",Alumnos!B190,\"\")","v":""},{"$f":"IF(Tareas!$W$1,Alumnos!C190*(30/Tareas!$W$1),\"\")","v":0},{"$f":"Alumnos!D190","v":0},{"$f":"IF(Tareas!$Y$1,Alumnos!E190*(30/Tareas!$Y$1),\"\")","v":0},{"$f":"Alumnos!F190","v":0},{"$f":"Alumnos!G190","v":0},{"$f":"Alumnos!H190","v":0},null,0,0,null,0]
[null,{"$f":"IF(Alumnos!B191<>\"\",Alumnos!B191,\"\")","v":""},{"$f":"IF(Tareas!$W$1,Alumnos!C191*(30/Tareas!$W$1),\"\")","v":0},{"$f":"Alumnos!D191","v":0},{"$f":"IF(Tareas!$Y$1,Alumnos!E191*(30/Tareas!$Y$1),\"\")","v":0},{"$f":"Alumnos!F191","v":0},{"$f":"Alumnos!G191","v":0},{"$f":"Alumnos!H191","v":0},null,0,0,null,0]
[null,{"$f":"IF(Alumnos!B192<>\"\",Alumnos!B192,\"\")","v":""},{"$f":"IF(Tareas!$W$1,Alumnos!C192*(30/Tareas!$W$1),\"\")","v":0},{"$f":"Alumnos!D192","v":0},{"$f":"IF(Tareas!$Y$1,Alumnos!E192*(30/Tareas!$Y$1),\"\")","v":0},{"$f":"Alumnos!F192","v":0},{"$f":"Alumnos!G192","v":0},{"$f":"Alumnos!H192","v":0},null,0,0,null,0]
[null,{"$f":"IF(Alumnos!B193<>\"\",Alumnos!B193,\"\")","v":""},{"$f":"IF(Tareas!$W$1,Alumnos!C193*(30/Tareas!$W$1),\"\")","v":0},{"$f":"Alumnos!D193","v":0},{"$f":"IF(Tareas!$Y$1,Alumnos!E193*(30/Tareas!$Y$1),\"\")","v":0},{"$f":"Alumnos!F193","v":0},{"$f":"Alumnos!G193","v":0},{"$f":"Alumnos!H193","v":0},null,0,0,null,0]
[null,{"$f":"IF(Alumnos!B194<>\"\",Alumnos!B194,\"\")","v":""},{"$f":"IF(Tareas!$W$1,Alumnos!C194*(30/Tareas!$W$1),\"\")","v":0},{"$f":"Alumnos!D194","v":0},{"$f":"IF(Tareas!$Y$1,Alumnos!E194*(30/Tareas!$Y$1),\"\")","v":0},{"$f":"Alumnos!F194","v":0},{"$f":"Alumnos!G194","v":0},{"$f":"Alumnos!H194","v":0},null,0,0,null,0]
[null,{"$f":"IF(Alumnos!B195<>\"\",Alumnos!B195,\"\")","v":""},{"$f":"IF(Tareas!$W$1,Alumnos!C195*(30/Tareas!$W$1),\"\")","v":0},{"$f":"Alumnos!D195","v":0},{"$f":"IF(Tareas!$Y$1,Alumnos!E195*(30/Tareas!$Y$1),\"\")","v":0},{"$f":"Alumnos!F195","v":0},{"$f":"Alumnos!G195","v":0},{"$f":"Alumnos!H195","v":0},null,{"$f":"SUM(C195:F195)","v":0},{"$f":"SUM(G195:H195)","v":0},null,{"$f":"(J195+K195)/2","v":0}]
[null,{"$f":"IF(Alumnos!B196<>\"\",Alumnos!B196,\"\")","v":""},{"$f":"IF(Tareas!$W$1,Alumnos!C196*(30/Tareas!$W$1),\"\")","v":0},{"$f":"Alumnos!D196","v":0},{"$f":"IF(Tareas!$Y$1,Alumnos!E196*(30/Tareas!$Y$1),\"\")","v":0},{"$f":"Alumnos!F196","v":0},{"$f":"Alumnos!G196","v":0},{"$f":"Alumnos!H196","v":0},null,0,0,null,0]
[null,{"$f":"IF(Alumnos!B197<>\"\",Alumnos!B197,\"\")","v":""},{"$f":"IF(Tareas!$W$1,Alumnos!C197*(30/Tareas!$W$1),\"\")","v":0},{"$f":"Alumnos!D197","v":0},{"$f":"IF(Tareas!$Y$1,Alumnos!E197*(30/Tareas!$Y$1),\"\")","v":0},{"$f":"Alumnos!F197","v":0},{"$f":"Alumnos!G197","v":0},{"$f":"Alumnos!H197","v":0},null,0,0,null,0]
[null,{"$f":"IF(Alumnos!B198<>\"\",Alumnos!B198,\"\")","v":""},{"$f":"IF(Tareas!$W$1,Alumnos!C198*(30/Tareas!$W$1),\"\")","v":0},{"$f":"Alumnos!D198","v":0},{"$f":"IF(Tareas!$Y$1,Alumnos!E198*(30/Tareas!$Y$1),\"\")","v":0},{"$f":"Alumnos!F198","v":0},{"$f":"Alumnos!G198","v":0},{"$f":"Alumnos!H198","v":0},null,0,0,null,0]
[null,{"$f":"IF(Alumnos!B199<>\"\",Alumnos!B199,\"\")","v":""},{"$f":"IF(Tareas!$W$1,Alumnos!C199*(30/Tareas!$W$1),\"\")","v":0},{"$f":"Alumnos!D199","v":0},{"$f":"IF(Tareas!$Y$1,Alumnos!E199*(30/Tareas!$Y$1),\"\")","v":0},{"$f":"Alumnos!F199","v":0},{"$f":"Alumnos!G199","v":0},{"$f":"Alumnos!H199","v":0},null,0,0,null,0]
[null,{"$f":"IF(Alumnos!B200<>\"\",Alumnos!B200,\"\")","v":""},{"$f":"IF(Tareas!$W$1,Alumnos!C200*(30/Tareas!$W$1),\"\")","v":0},{"$f":"Alumnos!D200","v":0},{"$f":"IF(Tareas!$Y$1,Alumnos!E200*(30/Tareas!$Y$1),\"\")","v":0},{"$f":"Alumnos!F200","v":0},{"$f":"Alumnos!G200","v":0},{"$f":"Alumnos!H200","v":0},null,0,0,null,0]
[null,{"$f":"IF(Alumnos!B201<>\"\",Alumnos!B201,\"\")","v":""},{"$f":"IF(Tareas!$W$1,Alumnos!C201*(30/Tareas!$W$1),\"\")","v":0},{"$f":"Alumnos!D201","v":0},{"$f":"IF(Tareas!$Y$1,Alumnos!E201*(30/Tareas!$Y$1),\"\")","v":0},{"$f":"Alumnos!F201","v":0},{"$f":"Alumnos!G201","v":0},{"$f":"Alumnos!H201","v":0},null,0,0,null,0]
[null,{"$f":"IF(Alumnos!B202<>\"\",Alumnos!B202,\"\")","v":""},{"$f":"IF(Tareas!$W$1,Alumnos!C202*(30/Tareas!$W$1),\"\")","v":0},{"$f":"Alumnos!D202","v":0},{"$f":"IF(Tareas!$Y$1,Alumnos!E202*(30/Tareas!$Y$1),\"\")","v":0},{"$f":"Alumnos!F202","v":0},{"$f":"Alumnos!G202","v":0},{"$f":"Alumnos!H202","v":0},null,0,0,null,0]
[null,{"$f":"IF(Alumnos!B203<>\"\",Alumnos!B203,\"\")","v":""},{"$f":"IF(Tareas!$W$1,Alumnos!C203*(30/Tareas!$W$1),\"\")","v":0},{"$f":"Alumnos!D203","v":0},{"$f":"IF(Tareas!$Y$1,Alumnos!E203*(30/Tareas!$Y$1),\"\")","v":0},{"$f":"Alumnos!F203","v":0},{"$f":"Alumnos!G203","v":0},{"$f":"Alumnos!H203","v":0},null,0,0,null,0]
[null,{"$f":"IF(Alumnos!B204<>\"\",Alumnos!B204,\"\")","v":""},{"$f":"IF(Tareas!$W$1,Alumnos!C204*(30/Tareas!$W$1),\"\")","v":0},{"$f":"Alumnos!D204","v":0},{"$f":"IF(Tareas!$Y$1,Alumnos!E204*(30/Tareas!$Y$1),\"\")","v":0},{"$f":"Alumnos!F204","v":0},{"$f":"Alumnos!G204","v":0},{"$f":"Alumnos!H204","v":0},null,0,0,null,0]
[null,{"$f":"IF(Alumnos!B205<>\"\",Alumnos!B205,\"\")","v":""},{"$f":"IF(Tareas!$W$1,Alumnos!C205*(30/Tareas!$W$1),\"\")","v":0},{"$f":"Alumnos!D205","v":0},{"$f":"IF(Tareas!$Y$1,Alumnos!E205*(30/Tareas!$Y$1),\"\")","v":0},{"$f":"Alumnos!F205","v":0},{"$f":"Alumnos!G205","v":0},{"$f":"Alumnos!H205","v":0},null,0,0,null,0]
[null,{"$f":"IF(Alumnos!B206<>\"\",Alumnos!B206,\"\")","v":""},{"$f":"IF(Tareas!$W$1,Alumnos!C206*(30/Tareas!$W$1),\"\")","v":0},{"$f":"Alumnos!D206","v":0},{"$f":"IF(Tareas!$Y$1,Alumnos!E206*(30/Tareas!$Y$1),\"\")","v":0},{"$f":"Alumnos!F206","v":0},{"$f":"Alumnos!G206","v":0},{"$f":"Alumnos!H206","v":0},null,0,0,null,0]
[null,{"$f":"IF(Alumnos!B207<>\"\",Alumnos!B207,\"\")","v":""},{"$f":"IF(Tareas!$W$1,Alumnos!C207*(30/Tareas!$W$1),\"\")","v":0},{"$f":"Alumnos!D207","v":0},{"$f":"IF(Tareas!$Y$1,Alumnos!E207*(30/Tareas!$Y$1),\"\")","v":0},{"$f":"Alumnos!F207","v":0},{"$f":"Alumnos!G207","v":0},{"$f":"Alumnos!H207","v":0},null,0,0,null,0]
[null,{"$f":"IF(Alumnos!B208<>\"\",Alumnos!B208,\"\")","v":""},{"$f":"IF(Tareas!$W$1,Alumnos!C208*(30/Tareas!$W$1),\"\")","v":0},{"$f":"Alumnos!D208","v":0},{"$f":"IF(Tareas!$Y$1,Alumnos!E208*(30/Tareas!$Y$1),\"\")","v":0},{"$f":"Alumnos!F208","v":0},{"$f":"Alumnos!G208","v":0},{"$f":"Alumnos!H208","v":0},null,0,0,null,0]
[null,{"$f":"IF(Alumnos!B209<>\"\",Alumnos!B209,\"\")","v":""},{"$f":"IF(Tareas!$W$1,Alumnos!C209*(30/Tareas!$W$1),\"\")","v":0},{"$f":"Alumnos!D209","v":0},{"$f":"IF(Tareas!$Y$1,Alumnos!E209*(30/Tareas!$Y$1),\"\")","v":0},{"$f":"Alumnos!F209","v":0},{"$f":"Alumnos!G209","v":0},{"$f":"Alumnos!H209","v":0},null,0,0,null,0]
[null,{"$f":"IF(Alumnos!B210<>\"\",Alumnos!B210,\"\")","v":""},{"$f":"IF(Tareas!$W$1,Alumnos!C210*(30/Tareas!$W$1),\"\")","v":0},{"$f":"Alumnos!D210","v":0},{"$f":"IF(Tareas!$Y$1,Alumnos!E210*(30/Tareas!$Y$1),\"\")","v":0},{"$f":"Alumnos!F210","v":0},{"$f":"Alumnos!G210","v":0},{"$f":"Alumnos!H210","v":0},null,0,0,null,0]
[null,{"$f":"IF(Alumnos!B211<>\"\",Alumnos!B211,\"\")","v":""},{"$f":"IF(Tareas!$W$1,Alumnos!C211*(30/Tareas!$W$1),\"\")","v":0},{"$f":"Alumnos!D211","v":0},{"$f":"IF(Tareas!$Y$1,Alumnos!E211*(30/Tareas!$Y$1),\"\")","v":0},{"$f":"Alumnos!F211","v":0},{"$f":"Alumnos!G211","v":0},{"$f":"Alumnos!H211","v":0},null,0,0,null,0]
[null,{"$f":"IF(Alumnos!B212<>\"\",Alumnos!B212,\"\")","v":""},{"$f":"IF(Tareas!$W$1,Alumnos!C212*(30/Tareas!$W$1),\"\")","v":0},{"$f":"Alumnos!D212","v":0},{"$f":"IF(Tareas!$Y$1,Alumnos!E212*(30/Tareas!$Y$1),\"\")","v":0},{"$f":"Alumnos!F212","v":0},{"$f":"Alumnos!G212","v":0},{"$f":"Alumnos!H212","v":0},null,0,0,null,0]
[null,{"$f":"IF(Alumnos!B213<>\"\",Alumnos!B213,\"\")","v":""},{"$f":"IF(Tareas!$W$1,Alumnos!C213*(30/Tareas!$W$1),\"\")","v":0},{"$f":"Alumnos!D213","v":0},{"$f":"IF(Tareas!$Y$1,Alumnos!E213*(30/Tareas!$Y$1),\"\")","v":0},{"$f":"Alumnos!F213","v":0},{"$f":"Alumnos!G213","v":0},{"$f":"Alumnos!H213","v":0},null,0,0,null,0]
[null,{"$f":"IF(Alumnos!B214<>\"\",Alumnos!B214,\"\")","v":""},{"$f":"IF(Tareas!$W$1,Alumnos!C214*(30/Tareas!$W$1),\"\")","v":0},{"$f":"Alumnos!D214","v":0},{"$f":"IF(Tareas!$Y$1,Alumnos!E214*(30/Tareas!$Y$1),\"\")","v":0},{"$f":"Alumnos!F214","v":0},{"$f":"Alumnos!G214","v":0},{"$f":"Alumnos!H214","v":0},null,0,0,null,0]
[null,{"$f":"IF(Alumnos!B215<>\"\",Alumnos!B215,\"\")","v":""},{"$f":"IF(Tareas!$W$1,Alumnos!C215*(30/Tareas!$W$1),\"\")","v":0},{"$f":"Alumnos!D215","v":0},{"$f":"IF(Tareas!$Y$1,Alumnos!E215*(30/Tareas!$Y$1),\"\")","v":0},{"$f":"Alumnos!F215","v":0},{"$f":"Alumnos!G215","v":0},{"$f":"Alumnos!H215","v":0},null,0,0,null,0]
[null,{"$f":"IF(Alumnos!B216<>\"\",Alumnos!B216,\"\")","v":""},{"$f":"IF(Tareas!$W$1,Alumnos!C216*(30/Tareas!$W$1),\"\")","v":0},{"$f":"Alumnos!D216","v":0},{"$f":"IF(Tareas!$Y$1,Alumnos!E216*(30/Tareas!$Y$1),\"\")","v":0},{"$f":"Alumnos!F216","v":0},{"$f":"Alumnos!G216","v":0},{"$f":"Alumnos!H216","v":0},null,0,0,null,0]
[null,{"$f":"IF(Alumnos!B217<>\"\",Alumnos!B217,\"\")","v":""},{"$f":"IF(Tareas!$W$1,Alumnos!C217*(30/Tareas!$W$1),\"\")","v":0},{"$f":"Alumnos!D217","v":0},{"$f":"IF(Tareas!$Y$1,Alumnos!E217*(30/Tareas!$Y$1),\"\")","v":0},{"$f":"Alumnos!F217","v":0},{"$f":"Alumnos!G217","v":0},{"$f":"Alumnos!H217","v":0},null,0,0,null,0]
[null,{"$f":"IF(Alumnos!B218<>\"\",Alumnos!B218,\"\")","v":""},{"$f":"IF(Tareas!$W$1,Alumnos!C218*(30/Tareas!$W$1),\"\")","v":0},{"$f":"Alumnos!D218","v":0},{"$f":"IF(Tareas!$Y$1,Alumnos!E218*(30/Tareas!$Y$1),\"\")","v":0},{"$f":"Alumnos!F218","v":0},{"$f":"Alumnos!G218","v":0},{"$f":"Alumnos!H218","v":0},null,0,0,null,0]
[null,{"$f":"IF(Alumnos!B219<>\"\",Alumnos!B219,\"\")","v":""},{"$f":"IF(Tareas!$W$1,Alumnos!C219*(30/Tareas!$W$1),\"\")","v":0},{"$f":"Alumnos!D219","v":0},{"$f":"IF(Tareas!$Y$1,Alumnos!E219*(30/Tareas!$Y$1),\"\")","v":0},{"$f":"Alumnos!F219","v":0},{"$f":"Alumnos!G219","v":0},{"$f":"Alumnos!H219","v":0},null,0,0,null,0]
[null,{"$f":"IF(Alumnos!B220<>\"\",Alumnos!B220,\"\")","v":""},{"$f":"IF(Tareas!$W$1,Alumnos!C220*(30/Tareas!$W$1),\"\")","v":0},{"$f":"Alumnos!D220","v":0},{"$f":"IF(Tareas!$Y$1,Alumnos!E220*(30/Tareas!$Y$1),\"\")","v":0},{"$f":"Alumnos!F220","v":0},{"$f":"Alumnos!G220","v":0},{"$f":"Alumnos!H220","v":0},null,0,0,null,0]
[null,{"$f":"IF(Alumnos!B221<>\"\",Alumnos!B221,\"\")","v":""},{"$f":"IF(Tareas!$W$1,Alumnos!C221*(30/Tareas!$W$1),\"\")","v":0},{"$f":"Alumnos!D221","v":0},{"$f":"IF(Tareas!$Y$1,Alumnos!E221*(30/Tareas!$Y$1),\"\")","v":0},{"$f":"Alumnos!F221","v":0},{"$f":"Alumnos!G221","v":0},{"$f":"Alumnos!H221","v":0},null,0,0,null,0]
[null,{"$f":"IF(Alumnos!B222<>\"\",Alumnos!B222,\"\")","v":""},{"$f":"IF(Tareas!$W$1,Alumnos!C222*(30/Tareas!$W$1),\"\")","v":0},{"$f":"Alumnos!D222","v":0},{"$f":"IF(Tareas!$Y$1,Alumnos!E222*(30/Tareas!$Y$1),\"\")","v":0},{"$f":"Alumnos!F222","v":0},{"$f":"Alumnos!G222","v":0},{"$f":"Alumnos!H222","v":0},null,0,0,null,0]
[null,{"$f":"IF(Alumnos!B223<>\"\",Alumnos!B223,\"\")","v":""},{"$f":"IF(Tareas!$W$1,Alumnos!C223*(30/Tareas!$W$1),\"\")","v":0},{"$f":"Alumnos!D223","v":0},{"$f":"IF(Tareas!$Y$1,Alumnos!E223*(30/Tareas!$Y$1),\"\")","v":0},{"$f":"Alumnos!F223","v":0},{"$f":"Alumnos!G223","v":0},{"$f":"Alumnos!H223","v":0},null,0,0,null,0]
[null,{"$f":"IF(Alumnos!B224<>\"\",Alumnos!B224,\"\")","v":""},{"$f":"IF(Tareas!$W$1,Alumnos!C224*(30/Tareas!$W$1),\"\")","v":0},{"$f":"Alumnos!D224","v":0},{"$f":"IF(Tareas!$Y$1,Alumnos!E224*(30/Tareas!$Y$1),\"\")","v":0},{"$f":"Alumnos!F224","v":0},{"$f":"Alumnos!G224","v":0},{"$f":"Alumnos!H224","v":0},null,0,0,null,0]
[null,{"$f":"IF(Alumnos!B225<>\"\",Alumnos!B225,\"\")","v":""},{"$f":"IF(Tareas!$W$1,Alumnos!C225*(30/Tareas!$W$1),\"\")","v":0},{"$f":"Alumnos!D225","v":0},{"$f":"IF(Tareas!$Y$1,Alumnos!E225*(30/Tareas!$Y$1),\"\")","v":0},{"$f":"Alumnos!F225","v":0},{"$f":"Alumnos!G225","v":0},{"$f":"Alumnos!H225","v":0},null,0,0,null,0]
[null,{"$f":"IF(Alumnos!B226<>\"\",Alumnos!B226,\"\")","v":""},{"$f":"IF(Tareas!$W$1,Alumnos!C226*(30/Tareas!$W$1),\"\")","v":0},{"$f":"Alumnos!D226","v":0},{"$f":"IF(Tareas!$Y$1,Alumnos!E226*(30/Tareas!$Y$1),\"\")","v":0},{"$f":"Alumnos!F226","v":0},{"$f":"Alumnos!G226","v":0},{"$f":"Alumnos!H226","v":0},null,0,0,null,0]
[null,{"$f":"IF(Alumnos!B227<>\"\",Alumnos!B227,\"\")","v":""},{"$f":"IF(Tareas!$W$1,Alumnos!C227*(30/Tareas!$W$1),\"\")","v":0},{"$f":"Alumnos!D227","v":0},{"$f":"IF(Tareas!$Y$1,Alumnos!E227*(30/Tareas!$Y$1),\"\")","v":0},{"$f":"Alumnos!F227","v":0},{"$f":"Alumnos!G227","v":0},{"$f":"Alumnos!H227","v":0},null,0,0,null,0]
[null,{"$f":"IF(Alumnos!B228<>\"\",Alumnos!B228,\"\")","v":""},{"$f":"IF(Tareas!$W$1,Alumnos!C228*(30/Tareas!$W$1),\"\")","v":0},{"$f":"Alumnos!D228","v":0},{"$f":"IF(Tareas!$Y$1,Alumnos!E228*(30/Tareas!$Y$1),\"\")","v":0},{"$f":"Alumnos!F228","v":0},{"$f":"Alumnos!G228","v":0},{"$f":"Alumnos!H228","v":0},null,0,0,null,0]
[null,{"$f":"IF(Alumnos!B229<>\"\",Alumnos!B229,\"\")","v":""},{"$f":"IF(Tareas!$W$1,Alumnos!C229*(30/Tareas!$W$1),\"\")","v":0},{"$f":"Alumnos!D229","v":0},{"$f":"IF(Tareas!$Y$1,Alumnos!E229*(30/Tareas!$Y$1),\"\")","v":0},{"$f":"Alumnos!F229","v":0},{"$f":"Alumnos!G229","v":0},{"$f":"Alumnos!H229","v":0},null,0,0,null,0]
[null,{"$f":"IF(Alumnos!B230<>\"\",Alumnos!B230,\"\")","v":""},{"$f":"IF(Tareas!$W$1,Alumnos!C230*(30/Tareas!$W$1),\"\")","v":0},{"$f":"Alumnos!D230","v":0},{"$f":"IF(Tareas!$Y$1,Alumnos!E230*(30/Tareas!$Y$1),\"\")","v":0},{"$f":"Alumnos!F230","v":0},{"$f":"Alumnos!G230","v":0},{"$f":"Alumnos!H230","v":0},null,0,0,null,0]
[null,{"$f":"IF(Alumnos!B231<>\"\",Alumnos!B231,\"\")","v":""},{"$f":"IF(Tareas!$W$1,Alumnos!C231*(30/Tareas!$W$1),\"\")","v":0},{"$f":"Alumnos!D231","v":0},{"$f":"IF(Tareas!$Y$1,Alumnos!E231*(30/Tareas!$Y$1),\"\")","v":0},{"$f":"Alumnos!F231","v":0},{"$f":"Alumnos!G231","v":0},{"$f":"Alumnos!H231","v":0},null,0,0,null,0]
[null,{"$f":"IF(Alumnos!B232<>\"\",Alumnos!B232,\"\")","v":""},{"$f":"IF(Tareas!$W$1,Alumnos!C232*(30/Tareas!$W$1),\"\")","v":0},{"$f":"Alumnos!D232","v":0},{"$f":"IF(Tareas!$Y$1,Alumnos!E232*(30/Tareas!$Y$1),\"\")","v":0},{"$f":"Alumnos!F232","v":0},{"$f":"Alumnos!G232","v":0},{"$f":"Alumnos!H232","v":0},null,0,0,null,0]
[null,{"$f":"IF(Alumnos!B233<>\"\",Alumnos!B233,\"\")","v":""},{"$f":"IF(Tareas!$W$1,Alumnos!C233*(30/Tareas!$W$1),\"\")","v":0},{"$f":"Alumnos!D233","v":0},{"$f":"IF(Tareas!$Y$1,Alumnos!E233*(30/Tareas!$Y$1),\"\")","v":0},{"$f":"Alumnos!F233","v":0},{"$f":"Alumnos!G233","v":0},{"$f":"Alumnos!H233","v":0},null,0,0,null,0]
[null,{"$f":"IF(Alumnos!B234<>\"\",Alumnos!B234,\"\")","v":""},{"$f":"IF(Tareas!$W$1,Alumnos!C234*(30/Tareas!$W$1),\"\")","v":0},{"$f":"Alumnos!D234","v":0},{"$f":"IF(Tareas!$Y$1,Alumnos!E234*(30/Tareas!$Y$1),\"\")","v":0},{"$f":"Alumnos!F234","v":0},{"$f":"Alumnos!G234","v":0},{"$f":"Alumnos!H234","v":0},null,0,0,null,0]
[null,{"$f":"IF(Alumnos!B235<>\"\",Alumnos!B235,\"\")","v":""},{"$f":"IF(Tareas!$W$1,Alumnos!C235*(30/Tareas!$W$1),\"\")","v":0},{"$f":"Alumnos!D235","v":0},{"$f":"IF(Tareas!$Y$1,Alumnos!E235*(30/Tareas!$Y$1),\"\")","v":0},{"$f":"Alumnos!F235","v":0},{"$f":"Alumnos!G235","v":0},{"$f":"Alumnos!H235","v":0},null,0,0,null,0]
[null,{"$f":"IF(Alumnos!B236<>\"\",Alumnos!B236,\"\")","v":""},{"$f":"IF(Tareas!$W$1,Alumnos!C236*(30/Tareas!$W$1),\"\")","v":0},{"$f":"Alumnos!D236","v":0},{"$f":"IF(Tareas!$Y$1,Alumnos!E236*(30/Tareas!$Y$1),\"\")","v":0},{"$f":"Alumnos!F236","v":0},{"$f":"Alumnos!G236","v":0},{"$f":"Alumnos!H236","v":0},null,0,0,null,0]
[null,{"$f":"IF(Alumnos!B237<>\"\",Alumnos!B237,\"\")","v":""},{"$f":"IF(Tareas!$W$1,Alumnos!C237*(30/Tareas!$W$1),\"\")","v":0},{"$f":"Alumnos!D237","v":0},{"$f":"IF(Tareas!$Y$1,Alumnos!E237*(30/Tareas!$Y$1),\"\")","v":0},{"$f":"Alumnos!F237","v":0},{"$f":"Alumnos!G237","v":0},{"$f":"Alumnos!H237","v":0},null,0,0,null,0]
[null,{"$f":"IF(Alumnos!B238<>\"\",Alumnos!B238,\"\")","v":""},{"$f":"IF(Tareas!$W$1,Alumnos!C238*(30/Tareas!$W$1),\"\")","v":0},{"$f":"Alumnos!D238","v":0},{"$f":"IF(Tareas!$Y$1,Alumnos!E238*(30/Tareas!$Y$1),\"\")","v":0},{"$f":"Alumnos!F238","v":0},{"$f":"Alumnos!G238","v":0},{"$f":"Alumnos!H238","v":0},null,0,0,null,0]
[null,{"$f":"IF(Alumnos!B239<>\"\",Alumnos!B239,\"\")","v":""},{"$f":"IF(Tareas!$W$1,Alumnos!C239*(30/Tareas!$W$1),\"\")","v":0},{"$f":"Alumnos!D239","v":0},{"$f":"IF(Tareas!$Y$1,Alumnos!E239*(30/Tareas!$Y$1),\"\")","v":0},{"$f":"Alumnos!F239","v":0},{"$f":"Alumnos!G239","v":0},{"$f":"Alumnos!H239","v":0},null,0,0,null,0]
[null,{"$f":"IF(Alumnos!B240<>\"\",Alumnos!B240,\"\")","v":""},{"$f":"IF(Tareas!$W$1,Alumnos!C240*(30/Tareas!$W$1),\"\")","v":0},{"$f":"Alumnos!D240","v":0},{"$f":"IF(Tareas!$Y$1,Alumnos!E240*(30/Tareas!$Y$1),\"\")","v":0},{"$f":"Alumnos!F240","v":0},{"$f":"Alumnos!G240","v":0},{"$f":"Alumnos!H240","v":0},null,0,0,null,0]
[null,{"$f":"IF(Alumnos!B241<>\"\",Alumnos!B241,\"\")","v":""},{"$f":"IF(Tareas!$W$1,Alumnos!C241*(30/Tareas!$W$1),\"\")","v":0},{"$f":"Alumnos!D241","v":0},{"$f":"IF(Tareas!$Y$1,Alumnos!E241*(30/Tareas!$Y$1),\"\")","v":0},{"$f":"Alumnos!F241","v":0},{"$f":"Alumnos!G241","v":0},{"$f":"Alumnos!H241","v":0},null,0,0,null,0]
[null,{"$f":"IF(Alumnos!B242<>\"\",Alumnos!B242,\"\")","v":""},{"$f":"IF(Tareas!$W$1,Alumnos!C242*(30/Tareas!$W$1),\"\")","v":0},{"$f":"Alumnos!D242","v":0},{"$f":"IF(Tareas!$Y$1,Alumnos!E242*(30/Tareas!$Y$1),\"\")","v":0},{"$f":"Alumnos!F242","v":0},{"$f":"Alumnos!G242","v":0},{"$f":"Alumnos!H242","v":0},null,0,0,null,0]
[null,{"$f":"IF(Alumnos!B243<>\"\",Alumnos!B243,\"\")","v":""},{"$f":"IF(Tareas!$W$1,Alumnos!C243*(30/Tareas!$W$1),\"\")","v":0},{"$f":"Alumnos!D243","v":0},{"$f":"IF(Tareas!$Y$1,Alumnos!E243*(30/Tareas!$Y$1),\"\")","v":0},{"$f":"Alumnos!F243","v":0},{"$f":"Alumnos!G243","v":0},{"$f":"Alumnos!H243","v":0},null,0,0,null,0]
[null,{"$f":"IF(Alumnos!B244<>\"\",Alumnos!B244,\"\")","v":""},{"$f":"IF(Tareas!$W$1,Alumnos!C244*(30/Tareas!$W$1),\"\")","v":0},{"$f":"Alumnos!D244","v":0},{"$f":"IF(Tareas!$Y$1,Alumnos!E244*(30/Tareas!$Y$1),\"\")","v":0},{"$f":"Alumnos!F244","v":0},{"$f":"Alumnos!G244","v":0},{"$f":"Alumnos!H244","v":0},null,0,0,null,0]
[null,{"$f":"IF(Alumnos!B245<>\"\",Alumnos!B245,\"\")","v":""},{"$f":"IF(Tareas!$W$1,Alumnos!C245*(30/Tareas!$W$1),\"\")","v":0},{"$f":"Alumnos!D245","v":0},{"$f":"IF(Tareas!$Y$1,Alumnos!E245*(30/Tareas!$Y$1),\"\")","v":0},{"$f":"Alumnos!F245","v":0},{"$f":"Alumnos!G245","v":0},{"$f":"Alumnos!H245","v":0},null,0,0,null,0]
[null,{"$f":"IF(Alumnos!B246<>\"\",Alumnos!B246,\"\")","v":""},{"$f":"IF(Tareas!$W$1,Alumnos!C246*(30/Tareas!$W$1),\"\")","v":0},{"$f":"Alumnos!D246","v":0},{"$f":"IF(Tareas!$Y$1,Alumnos!E246*(30/Tareas!$Y$1),\"\")","v":0},{"$f":"Alumnos!F246","v":0},{"$f":"Alumnos!G246","v":0},{"$f":"Alumnos!H246","v":0},null,0,0,null,0]
[null,{"$f":"IF(Alumnos!B247<>\"\",Alumnos!B247,\"\")","v":""},{"$f":"IF(Tareas!$W$1,Alumnos!C247*(30/Tareas!$W$1),\"\")","v":0},{"$f":"Alumnos!D247","v":0},{"$f":"IF(Tareas!$Y$1,Alumnos!E247*(30/Tareas!$Y$1),\"\")","v":0},{"$f":"Alumnos!F247","v":0},{"$f":"Alumnos!G247","v":0},{"$f":"Alumnos!H247","v":0},null,0,0,null,0]
[null,{"$f":"IF(Alumnos!B248<>\"\",Alumnos!B248,\"\")","v":""},{"$f":"IF(Tareas!$W$1,Alumnos!C248*(30/Tareas!$W$1),\"\")","v":0},{"$f":"Alumnos!D248","v":0},{"$f":"IF(Tareas!$Y$1,Alumnos!E248*(30/Tareas!$Y$1),\"\")","v":0},{"$f":"Alumnos!F248","v":0},{"$f":"Alumnos!G248","v":0},{"$f":"Alumnos!H248","v":0},null,0,0,null,0]
[null,{"$f":"IF(Alumnos!B249<>\"\",Alumnos!B249,\"\")","v":""},{"$f":"IF(Tareas!$W$1,Alumnos!C249*(30/Tareas!$W$1),\"\")","v":0},{"$f":"Alumnos!D249","v":0},{"$f":"IF(Tareas!$Y$1,Alumnos!E249*(30/Tareas!$Y$1),\"\")","v":0},{"$f":"Alumnos!F249","v":0},{"$f":"Alumnos!G249","v":0},{"$f":"Alumnos!H249","v":0},null,0,0,null,0]
[null,{"$f":"IF(Alumnos!B250<>\"\",Alumnos!B250,\"\")","v":""},{"$f":"IF(Tareas!$W$1,Alumnos!C250*(30/Tareas!$W$1),\"\")","v":0},{"$f":"Alumnos!D250","v":0},{"$f":"IF(Tareas!$Y$1,Alumnos!E250*(30/Tareas!$Y$1),\"\")","v":0},{"$f":"Alumnos!F250","v":0},{"$f":"Alumnos!G250","v":0},{"$f":"Alumnos!H250","v":0},null,0,0,null,0]
[null,{"$f":"IF(Alumnos!B251<>\"\",Alumnos!B251,\"\")","v":""},{"$f":"IF(Tareas!$W$1,Alumnos!C251*(30/Tareas!$W$1),\"\")","v":0},{"$f":"Alumnos!D251","v":0},{"$f":"IF(Tareas!$Y$1,Alumnos!E251*(30/Tareas!$Y$1),\"\")","v":0},{"$f":"Alumnos!F251","v":0},{"$f":"Alumnos!G251","v":0},{"$f":"Alumnos!H251","v":0},null,0,0,null,0]
[null,{"$f":"IF(Alumnos!B252<>\"\",Alumnos!B252,\"\")","v":""},{"$f":"IF(Tareas!$W$1,Alumnos!C252*(30/Tareas!$W$1),\"\")","v":0},{"$f":"Alumnos!D252","v":0},{"$f":"IF(Tareas!$Y$1,Alumnos!E252*(30/Tareas!$Y$1),\"\")","v":0},{"$f":"Alumnos!F252","v":0},{"$f":"Alumnos!G252","v":0},{"$f":"Alumnos!H252","v":0},null,0,0,null,0]
[null,{"$f":"IF(Alumnos!B253<>\"\",Alumnos!B253,\"\")","v":""},{"$f":"IF(Tareas!$W$1,Alumnos!C253*(30/Tareas!$W$1),\"\")","v":0},{"$f":"Alumnos!D253","v":0},{"$f":"IF(Tareas!$Y$1,Alumnos!E253*(30/Tareas!$Y$1),\"\")","v":0},{"$f":"Alumnos!F253","v":0},{"$f":"Alumnos!G253","v":0},{"$f":"Alumnos!H253","v":0},null,0,0,null,0]
[null,{"$f":"IF(Alumnos!B254<>\"\",Alumnos!B254,\"\")","v":""},{"$f":"IF(Tareas!$W$1,Alumnos!C254*(30/Tareas!$W$1),\"\")","v":0},{"$f":"Alumnos!D254","v":0},{"$f":"IF(Tareas!$Y$1,Alumnos!E254*(30/Tareas!$Y$1),\"\")","v":0},{"$f":"Alumnos!F254","v":0},{"$f":"Alumnos!G254","v":0},{"$f":"Alumnos!H254","v":0},null,0,0,null,0]
[null,{"$f":"IF(Alumnos!B255<>\"\",Alumnos!B255,\"\")","v":""},{"$f":"IF(Tareas!$W$1,Alumnos!C255*(30/Tareas!$W$1),\"\")","v":0},{"$f":"Alumnos!D255","v":0},{"$f":"IF(Tareas!$Y$1,Alumnos!E255*(30/Tareas!$Y$1),\"\")","v":0},{"$f":"Alumnos!F255","v":0},{"$f":"Alumnos!G255","v":0},{"$f":"Alumnos!H255","v":0},null,0,0,null,0]
[null,{"$f":"IF(Alumnos!B256<>\"\",Alumnos!B256,\"\")","v":""},{"$f":"IF(Tareas!$W$1,Alumnos!C256*(30/Tareas!$W$1),\"\")","v":0},{"$f":"Alumnos!D256","v":0},{"$f":"IF(Tareas!$Y$1,Alumnos!E256*(30/Tareas!$Y$1),\"\")","v":0},{"$f":"Alumnos!F256","v":0},{"$f":"Alumnos!G256","v":0},{"$f":"Alumnos!H256","v":0},null,0,0,null,0]
[null,{"$f":"IF(Alumnos!B257<>\"\",Alumnos!B257,\"\")","v":""},{"$f":"IF(Tareas!$W$1,Alumnos!C257*(30/Tareas!$W$1),\"\")","v":0},{"$f":"Alumnos!D257","v":0},{"$f":"IF(Tareas!$Y$1,Alumnos!E257*(30/Tareas!$Y$1),\"\")","v":0},{"$f":"Alumnos!F257","v":0},{"$f":"Alumnos!G257","v":0},{"$f":"Alumnos!H257","v":0},null,0,0,null,0]
[null,{"$f":"IF(Alumnos!B258<>\"\",Alumnos!B258,\"\")","v":""},{"$f":"IF(Tareas!$W$1,Alumnos!C258*(30/Tareas!$W$1),\"\")","v":0},{"$f":"Alumnos!D258","v":0},{"$f":"IF(Tareas!$Y$1,Alumnos!E258*(30/Tareas!$Y$1),\"\")","v":0},{"$f":"Alumnos!F258","v":0},{"$f":"Alumnos!G258","v":0},{"$f":"Alumnos!H258","v":0},null,0,0,null,0]
[null,{"$f":"IF(Alumnos!B259<>\"\",Alumnos!B259,\"\")","v":""},{"$f":"IF(Tareas!$W$1,Alumnos!C259*(30/Tareas!$W$1),\"\")","v":0},{"$f":"Alumnos!D259","v":0},{"$f":"IF(Tareas!$Y$1,Alumnos!E259*(30/Tareas!$Y$1),\"\")","v":0},{"$f":"Alumnos!F259","v":0},{"$f":"Alumnos!G259","v":0},{"$f":"Alumnos!H259","v":0},null,{"$f":"SUM(C259:F259)","v":0},{"$f":"SUM(G259:H259)","v":0},null,{"$f":"(J259+K259)/2","v":0}]
[null,{"$f":"IF(Alumnos!B260<>\"\",Alumnos!B260,\"\")","v":""},{"$f":"IF(Tareas!$W$1,Alumnos!C260*(30/Tareas!$W$1),\"\")","v":0},{"$f":"Alumnos!D260","v":0},{"$f":"IF(Tareas!$Y$1,Alumnos!E260*(30/Tareas!$Y$1),\"\")","v":0},{"$f":"Alumnos!F260","v":0},{"$f":"Alumnos!G260","v":0},{"$f":"Alumnos!H260","v":0},null,0,0,null,0]
[null,{"$f":"IF(Alumnos!B261<>\"\",Alumnos!B261,\"\")","v":""},{"$f":"IF(Tareas!$W$1,Alumnos!C261*(30/Tareas!$W$1),\"\")","v":0},{"$f":"Alumnos!D261","v":0},{"$f":"IF(Tareas!$Y$1,Alumnos!E261*(30/Tareas!$Y$1),\"\")","v":0},{"$f":"Alumnos!F261","v":0},{"$f":"Alumnos!G261","v":0},{"$f":"Alumnos!H261","v":0},null,0,0,null,0]
[null,{"$f":"IF(Alumnos!B262<>\"\",Alumnos!B262,\"\")","v":""},{"$f":"IF(Tareas!$W$1,Alumnos!C262*(30/Tareas!$W$1),\"\")","v":0},{"$f":"Alumnos!D262","v":0},{"$f":"IF(Tareas!$Y$1,Alumnos!E262*(30/Tareas!$Y$1),\"\")","v":0},{"$f":"Alumnos!F262","v":0},{"$f":"Alumnos!G262","v":0},{"$f":"Alumnos!H262","v":0},null,0,0,null,0]
[null,{"$f":"IF(Alumnos!B263<>\"\",Alumnos!B263,\"\")","v":""},{"$f":"IF(Tareas!$W$1,Alumnos!C263*(30/Tareas!$W$1),\"\")","v":0},{"$f":"Alumnos!D263","v":0},{"$f":"IF(Tareas!$Y$1,Alumnos!E263*(30/Tareas!$Y$1),\"\")","v":0},{"$f":"Alumnos!F263","v":0},{"$f":"Alumnos!G263","v":0},{"$f":"Alumnos!H263","v":0},null,0,0,null,0]
[null,{"$f":"IF(Alumnos!B264<>\"\",Alumnos!B264,\"\")","v":""},{"$f":"IF(Tareas!$W$1,Alumnos!C264*(30/Tareas!$W$1),\"\")","v":0},{"$f":"Alumnos!D264","v":0},{"$f":"IF(Tareas!$Y$1,Alumnos!E264*(30/Tareas!$Y$1),\"\")","v":0},{"$f":"Alumnos!F264","v":0},{"$f":"Alumnos!G264","v":0},{"$f":"Alumnos!H264","v":0},null,0,0,null,0]
[null,{"$f":"IF(Alumnos!B265<>\"\",Alumnos!B265,\"\")","v":""},{"$f":"IF(Tareas!$W$1,Alumnos!C265*(30/Tareas!$W$1),\"\")","v":0},{"$f":"Alumnos!D265","v":0},{"$f":"IF(Tareas!$Y$1,Alumnos!E265*(30/Tareas!$Y$1),\"\")","v":0},{"$f":"Alumnos!F265","v":0},{"$f":"Alumnos!G265","v":0},{"$f":"Alumnos!H265","v":0},null,0,0,null,0]
[null,{"$f":"IF(Alumnos!B266<>\"\",Alumnos!B266,\"\")","v":""},{"$f":"IF(Tareas!$W$1,Alumnos!C266*(30/Tareas!$W$1),\"\")","v":0},{"$f":"Alumnos!D266","v":0},{"$f":"IF(Tareas!$Y$1,Alumnos!E266*(30/Tareas!$Y$1),\"\")","v":0},{"$f":"Alumnos!F266","v":0},{"$f":"Alumnos!G266","v":0},{"$f":"Alumnos!H266","v":0},null,0,0,null,0]
[null,{"$f":"IF(Alumnos!B267<>\"\",Alumnos!B267,\"\")","v":""},{"$f":"IF(Tareas!$W$1,Alumnos!C267*(30/Tareas!$W$1),\"\")","v":0},{"$f":"Alumnos!D267","v":0},{"$f":"IF(Tareas!$Y$1,Alumnos!E267*(30/Tareas!$Y$1),\"\")","v":0},{"$f":"Alumnos!F267","v":0},{"$f":"Alumnos!G267","v":0},{"$f":"Alumnos!H267","v":0},null,0,0,null,0]
[null,{"$f":"IF(Alumnos!B268<>\"\",Alumnos!B268,\"\")","v":""},{"$f":"IF(Tareas!$W$1,Alumnos!C268*(30/Tareas!$W$1),\"\")","v":0},{"$f":"Alumnos!D268","v":0},{"$f":"IF(Tareas!$Y$1,Alumnos!E268*(30/Tareas!$Y$1),\"\")","v":0},{"$f":"Alumnos!F268","v":0},{"$f":"Alumnos!G268","v":0},{"$f":"Alumnos!H268","v":0},null,0,0,null,0]
[null,{"$f":"IF(Alumnos!B269<>\"\",Alumnos!B269,\"\")","v":""},{"$f":"IF(Tareas!$W$1,Alumnos!C269*(30/Tareas!$W$1),\"\")","v":0},{"$f":"Alumnos!D269","v":0},{"$f":"IF(Tareas!$Y$1,Alumnos!E269*(30/Tareas!$Y$1),\"\")","v":0},{"$f":"Alumnos!F269","v":0},{"$f":"Alumnos!G269","v":0},{"$f":"Alumnos!H269","v":0},null,0,0,null,0]
[null,{"$f":"IF(Alumnos!B270<>\"\",Alumnos!B270,\"\")","v":""},{"$f":"IF(Tareas!$W$1,Alumnos!C270*(30/Tareas!$W$1),\"\")","v":0},{"$f":"Alumnos!D270","v":0},{"$f":"IF(Tareas!$Y$1,Alumnos!E270*(30/Tareas!$Y$1),\"\")","v":0},{"$f":"Alumnos!F270","v":0},{"$f":"Alumnos!G270","v":0},{"$f":"Alumnos!H270","v":0},null,0,0,null,0]
[null,{"$f":"IF(Alumnos!B271<>\"\",Alumnos!B271,\"\")","v":""},{"$f":"IF(Tareas!$W$1,Alumnos!C271*(30/Tareas!$W$1),\"\")","v":0},{"$f":"Alumnos!D271","v":0},{"$f":"IF(Tareas!$Y$1,Alumnos!E271*(30/Tareas!$Y$1),\"\")","v":0},{"$f":"Alumnos!F271","v":0},{"$f":"Alumnos!G271","v":0},{"$f":"Alumnos!H271","v":0},null,0,0,null,0]
[null,{"$f":"IF(Alumnos!B272<>\"\",Alumnos!B272,\"\")","v":""},{"$f":"IF(Tareas!$W$1,Alumnos!C272*(30/Tareas!$W$1),\"\")","v":0},{"$f":"Alumnos!D272","v":0},{"$f":"IF(Tareas!$Y$1,Alumnos!E272*(30/Tareas!$Y$1),\"\")","v":0},{"$f":"Alumnos!F272","v":0},{"$f":"Alumnos!G272","v":0},{"$f":"Alumnos!H272","v":0},null,0,0,null,0]
[null,{"$f":"IF(Alumnos!B273<>\"\",Alumnos!B273,\"\")","v":""},{"$f":"IF(Tareas!$W$1,Alumnos!C273*(30/Tareas!$W$1),\"\")","v":0},{"$f":"Alumnos!D273","v":0},{"$f":"IF(Tareas!$Y$1,Alumnos!E273*(30/Tareas!$Y$1),\"\")","v":0},{"$f":"Alumnos!F273","v":0},{"$f":"Alumnos!G273","v":0},{"$f":"Alumnos!H273","v":0},null,0,0,null,0]
[null,{"$f":"IF(Alumnos!B274<>\"\",Alumnos!B274,\"\")","v":""},{"$f":"IF(Tareas!$W$1,Alumnos!C274*(30/Tareas!$W$1),\"\")","v":0},{"$f":"Alumnos!D274","v":0},{"$f":"IF(Tareas!$Y$1,Alumnos!E274*(30/Tareas!$Y$1),\"\")","v":0},{"$f":"Alumnos!F274","v":0},{"$f":"Alumnos!G274","v":0},{"$f":"Alumnos!H274","v":0},null,0,0,null,0]
[null,{"$f":"IF(Alumnos!B275<>\"\",Alumnos!B275,\"\")","v":""},{"$f":"IF(Tareas!$W$1,Alumnos!C275*(30/Tareas!$W$1),\"\")","v":0},{"$f":"Alumnos!D275","v":0},{"$f":"IF(Tareas!$Y$1,Alumnos!E275*(30/Tareas!$Y$1),\"\")","v":0},{"$f":"Alumnos!F275","v":0},{"$f":"Alumnos!G275","v":0},{"$f":"Alumnos!H275","v":0},null,0,0,null,0]
[null,{"$f":"IF(Alumnos!B276<>\"\",Alumnos!B276,\"\")","v":""},{"$f":"IF(Tareas!$W$1,Alumnos!C276*(30/Tareas!$W$1),\"\")","v":0},{"$f":"Alumnos!D276","v":0},{"$f":"IF(Tareas!$Y$1,Alumnos!E276*(30/Tareas!$Y$1),\"\")","v":0},{"$f":"Alumnos!F276","v":0},{"$f":"Alumnos!G276","v":0},{"$f":"Alumnos!H276","v":0},null,0,0,null,0]
[null,{"$f":"IF(Alumnos!B277<>\"\",Alumnos!B277,\"\")","v":""},{"$f":"IF(Tareas!$W$1,Alumnos!C277*(30/Tareas!$W$1),\"\")","v":0},{"$f":"Alumnos!D277","v":0},{"$f":"IF(Tareas!$Y$1,Alumnos!E277*(30/Tareas!$Y$1),\"\")","v":0},{"$f":"Alumnos!F277","v":0},{"$f":"Alumnos!G277","v":0},{"$f":"Alumnos!H277","v":0},null,0,0,null,0]
[null,{"$f":"IF(Alumnos!B278<>\"\",Alumnos!B278,\"\")","v":""},{"$f":"IF(Tareas!$W$1,Alumnos!C278*(30/Tareas!$W$1),\"\")","v":0},{"$f":"Alumnos!D278","v":0},{"$f":"IF(Tareas!$Y$1,Alumnos!E278*(30/Tareas!$Y$1),\"\")","v":0},{"$f":"Alumnos!F278","v":0},{"$f":"Alumnos!G278","v":0},{"$f":"Alumnos!H278","v":0},null,0,0,null,0]
[null,{"$f":"IF(Alumnos!B279<>\"\",Alumnos!B279,\"\")","v":""},{"$f":"IF(Tareas!$W$1,Alumnos!C279*(30/Tareas!$W$1),\"\")","v":0},{"$f":"Alumnos!D279","v":0},{"$f":"IF(Tareas!$Y$1,Alumnos!E279*(30/Tareas!$Y$1),\"\")","v":0},{"$f":"Alumnos!F279","v":0},{"$f":"Alumnos!G279","v":0},{"$f":"Alumnos!H279","v":0},null,0,0,null,0]
[null,{"$f":"IF(Alumnos!B280<>\"\",Alumnos!B280,\"\")","v":""},{"$f":"IF(Tareas!$W$1,Alumnos!C280*(30/Tareas!$W$1),\"\")","v":0},{"$f":"Alumnos!D280","v":0},{"$f":"IF(Tareas!$Y$1,Alumnos!E280*(30/Tareas!$Y$1),\"\")","v":0},{"$f":"Alumnos!F280","v":0},{"$f":"Alumnos!G280","v":0},{"$f":"Alumnos!H280","v":0},null,0,0,null,0]
[null,{"$f":"IF(Alumnos!B281<>\"\",Alumnos!B281,\"\")","v":""},{"$f":"IF(Tareas!$W$1,Alumnos!C281*(30/Tareas!$W$1),\"\")","v":0},{"$f":"Alumnos!D281","v":0},{"$f":"IF(Tareas!$Y$1,Alumnos!E281*(30/Tareas!$Y$1),\"\")","v":0},{"$f":"Alumnos!F281","v":0},{"$f":"Alumnos!G281","v":0},{"$f":"Alumnos!H281","v":0},null,0,0,null,0]
[null,{"$f":"IF(Alumnos!B282<>\"\",Alumnos!B282,\"\")","v":""},{"$f":"IF(Tareas!$W$1,Alumnos!C282*(30/Tareas!$W$1),\"\")","v":0},{"$f":"Alumnos!D282","v":0},{"$f":"IF(Tareas!$Y$1,Alumnos!E282*(30/Tareas!$Y$1),\"\")","v":0},{"$f":"Alumnos!F282","v":0},{"$f":"Alumnos!G282","v":0},{"$f":"Alumnos!H282","v":0},null,0,0,null,0]
[null,{"$f":"IF(Alumnos!B283<>\"\",Alumnos!B283,\"\")","v":""},{"$f":"IF(Tareas!$W$1,Alumnos!C283*(30/Tareas!$W$1),\"\")","v":0},{"$f":"Alumnos!D283","v":0},{"$f":"IF(Tareas!$Y$1,Alumnos!E283*(30/Tareas!$Y$1),\"\")","v":0},{"$f":"Alumnos!F283","v":0},{"$f":"Alumnos!G283","v":0},{"$f":"Alumnos!H283","v":0},null,0,0,null,0]
[null,{"$f":"IF(Alumnos!B284<>\"\",Alumnos!B284,\"\")","v":""},{"$f":"IF(Tareas!$W$1,Alumnos!C284*(30/Tareas!$W$1),\"\")","v":0},{"$f":"Alumnos!D284","v":0},{"$f":"IF(Tareas!$Y$1,Alumnos!E284*(30/Tareas!$Y$1),\"\")","v":0},{"$f":"Alumnos!F284","v":0},{"$f":"Alumnos!G284","v":0},{"$f":"Alumnos!H284","v":0},null,0,0,null,0]
[null,{"$f":"IF(Alumnos!B285<>\"\",Alumnos!B285,\"\")","v":""},{"$f":"IF(Tareas!$W$1,Alumnos!C285*(30/Tareas!$W$1),\"\")","v":0},{"$f":"Alumnos!D285","v":0},{"$f":"IF(Tareas!$Y$1,Alumnos!E285*(30/Tareas!$Y$1),\"\")","v":0},{"$f":"Alumnos!F285","v":0},{"$f":"Alumnos!G285","v":0},{"$f":"Alumnos!H285","v":0},null,0,0,null,0]
[null,{"$f":"IF(Alumnos!B286<>\"\",Alumnos!B286,\"\")","v":""},{"$f":"IF(Tareas!$W$1,Alumnos!C286*(30/Tareas!$W$1),\"\")","v":0},{"$f":"Alumnos!D286","v":0},{"$f":"IF(Tareas!$Y$1,Alumnos!E286*(30/Tareas!$Y$1),\"\")","v":0},{"$f":"Alumnos!F286","v":0},{"$f":"Alumnos!G286","v":0},{"$f":"Alumnos!H286","v":0},null,0,0,null,0]
[null,{"$f":"IF(Alumnos!B287<>\"\",Alumnos!B287,\"\")","v":""},{"$f":"IF(Tareas!$W$1,Alumnos!C287*(30/Tareas!$W$1),\"\")","v":0},{"$f":"Alumnos!D287","v":0},{"$f":"IF(Tareas!$Y$1,Alumnos!E287*(30/Tareas!$Y$1),\"\")","v":0},{"$f":"Alumnos!F287","v":0},{"$f":"Alumnos!G287","v":0},{"$f":"Alumnos!H287","v":0},null,0,0,null,0]
[null,{"$f":"IF(Alumnos!B288<>\"\",Alumnos!B288,\"\")","v":""},{"$f":"IF(Tareas!$W$1,Alumnos!C288*(30/Tareas!$W$1),\"\")","v":0},{"$f":"Alumnos!D288","v":0},{"$f":"IF(Tareas!$Y$1,Alumnos!E288*(30/Tareas!$Y$1),\"\")","v":0},{"$f":"Alumnos!F288","v":0},{"$f":"Alumnos!G288","v":0},{"$f":"Alumnos!H288","v":0},null,0,0,null,0]
[null,{"$f":"IF(Alumnos!B289<>\"\",Alumnos!B289,\"\")","v":""},{"$f":"IF(Tareas!$W$1,Alumnos!C289*(30/Tareas!$W$1),\"\")","v":0},{"$f":"Alumnos!D289","v":0},{"$f":"IF(Tareas!$Y$1,Alumnos!E289*(30/Tareas!$Y$1),\"\")","v":0},{"$f":"Alumnos!F289","v":0},{"$f":"Alumnos!G289","v":0},{"$f":"Alumnos!H289","v":0},null,0,0,null,0]
[null,{"$f":"IF(Alumnos!B290<>\"\",Alumnos!B290,\"\")","v":""},{"$f":"IF(Tareas!$W$1,Alumnos!C290*(30/Tareas!$W$1),\"\")","v":0},{"$f":"Alumnos!D290","v":0},{"$f":"IF(Tareas!$Y$1,Alumnos!E290*(30/Tareas!$Y$1),\"\")","v":0},{"$f":"Alumnos!F290","v":0},{"$f":"Alumnos!G290","v":0},{"$f":"Alumnos!H290","v":0},null,0,0,null,0]
[null,{"$f":"IF(Alumnos!B291<>\"\",Alumnos!B291,\"\")","v":""},{"$f":"IF(Tareas!$W$1,Alumnos!C291*(30/Tareas!$W$1),\"\")","v":0},{"$f":"Alumnos!D291","v":0},{"$f":"IF(Tareas!$Y$1,Alumnos!E291*(30/Tareas!$Y$1),\"\")","v":0},{"$f":"Alumnos!F291","v":0},{"$f":"Alumnos!G291","v":0},{"$f":"Alumnos!H291","v":0},null,0,0,null,0]
[null,{"$f":"IF(Alumnos!B292<>\"\",Alumnos!B292,\"\")","v":""},{"$f":"IF(Tareas!$W$1,Alumnos!C292*(30/Tareas!$W$1),\"\")","v":0},{"$f":"Alumnos!D292","v":0},{"$f":"IF(Tareas!$Y$1,Alumnos!E292*(30/Tareas!$Y$1),\"\")","v":0},{"$f":"Alumnos!F292","v":0},{"$f":"Alumnos!G292","v":0},{"$f":"Alumnos!H292","v":0},null,0,0,null,0]
[null,{"$f":"IF(Alumnos!B293<>\"\",Alumnos!B293,\"\")","v":""},{"$f":"IF(Tareas!$W$1,Alumnos!C293*(30/Tareas!$W$1),\"\")","v":0},{"$f":"Alumnos!D293","v":0},{"$f":"IF(Tareas!$Y$1,Alumnos!E293*(30/Tareas!$Y$1),\"\")","v":0},{"$f":"Alumnos!F293","v":0},{"$f":"Alumnos!G293","v":0},{"$f":"Alumnos!H293","v":0},null,0,0,null,0]
[null,{"$f":"IF(Alumnos!B294<>\"\",Alumnos!B294,\"\")","v":""},{"$f":"IF(Tareas!$W$1,Alumnos!C294*(30/Tareas!$W$1),\"\")","v":0},{"$f":"Alumnos!D294","v":0},{"$f":"IF(Tareas!$Y$1,Alumnos!E294*(30/Tareas!$Y$1),\"\")","v":0},{"$f":"Alumnos!F294","v":0},{"$f":"Alumnos!G294","v":0},{"$f":"Alumnos!H294","v":0},null,0,0,null,0]
[null,{"$f":"IF(Alumnos!B295<>\"\",Alumnos!B295,\"\")","v":""},{"$f":"IF(Tareas!$W$1,Alumnos!C295*(30/Tareas!$W$1),\"\")","v":0},{"$f":"Alumnos!D295","v":0},{"$f":"IF(Tareas!$Y$1,Alumnos!E295*(30/Tareas!$Y$1),\"\")","v":0},{"$f":"Alumnos!F295","v":0},{"$f":"Alumnos!G295","v":0},{"$f":"Alumnos!H295","v":0},null,0,0,null,0]
[null,{"$f":"IF(Alumnos!B296<>\"\",Alumnos!B296,\"\")","v":""},{"$f":"IF(Tareas!$W$1,Alumnos!C296*(30/Tareas!$W$1),\"\")","v":0},{"$f":"Alumnos!D296","v":0},{"$f":"IF(Tareas!$Y$1,Alumnos!E296*(30/Tareas!$Y$1),\"\")","v":0},{"$f":"Alumnos!F296","v":0},{"$f":"Alumnos!G296","v":0},{"$f":"Alumnos!H296","v":0},null,0,0,null,0]
[null,{"$f":"IF(Alumnos!B297<>\"\",Alumnos!B297,\"\")","v":""},{"$f":"IF(Tareas!$W$1,Alumnos!C297*(30/Tareas!$W$1),\"\")","v":0},{"$f":"Alumnos!D297","v":0},{"$f":"IF(Tareas!$Y$1,Alumnos!E297*(30/Tareas!$Y$1),\"\")","v":0},{"$f":"Alumnos!F297","v":0},{"$f":"Alumnos!G297","v":0},{"$f":"Alumnos!H297","v":0},null,0,0,null,0]
[null,{"$f":"IF(Alumnos!B298<>\"\",Alumnos!B298,\"\")","v":""},{"$f":"IF(Tareas!$W$1,Alumnos!C298*(30/Tareas!$W$1),\"\")","v":0},{"$f":"Alumnos!D298","v":0},{"$f":"IF(Tareas!$Y$1,Alumnos!E298*(30/Tareas!$Y$1),\"\")","v":0},{"$f":"Alumnos!F298","v":0},{"$f":"Alumnos!G298","v":0},{"$f":"Alumnos!H298","v":0},null,0,0,null,0]
[null,{"$f":"IF(Alumnos!B299<>\"\",Alumnos!B299,\"\")","v":""},{"$f":"IF(Tareas!$W$1,Alumnos!C299*(30/Tareas!$W$1),\"\")","v":0},{"$f":"Alumnos!D299","v":0},{"$f":"IF(Tareas!$Y$1,Alumnos!E299*(30/Tareas!$Y$1),\"\")","v":0},{"$f":"Alumnos!F299","v":0},{"$f":"Alumnos!G299","v":0},{"$f":"Alumnos!H299","v":0},null,0,0,null,0]
[null,{"$f":"IF(Alumnos!B300<>\"\",Alumnos!B300,\"\")","v":""},{"$f":"IF(Tareas!$W$1,Alumnos!C300*(30/Tareas!$W$1),\"\")","v":0},{"$f":"Alumnos!D300","v":0},{"$f":"IF(Tareas!$Y$1,Alumnos!E300*(30/Tareas!$Y$1),\"\")","v":0},{"$f":"Alumnos!F300","v":0},{"$f":"Alumnos!G300","v":0},{"$f":"Alumnos!H300","v":0},null,0,0,null,0]
[null,{"$f":"IF(Alumnos!B301<>\"\",Alumnos!B301,\"\")","v":""},{"$f":"IF(Tareas!$W$1,Alumnos!C301*(30/Tareas!$W$1),\"\")","v":0},{"$f":"Alumnos!D301","v":0},{"$f":"IF(Tareas!$Y$1,Alumnos!E301*(30/Tareas!$Y$1),\"\")","v":0},{"$f":"Alumnos!F301","v":0},{"$f":"Alumnos!G301","v":0},{"$f":"Alumnos!H301","v":0},null,0,0,null,0]
[null,{"$f":"IF(Alumnos!B302<>\"\",Alumnos!B302,\"\")","v":""},{"$f":"IF(Tareas!$W$1,Alumnos!C302*(30/Tareas!$W$1),\"\")","v":0},{"$f":"Alumnos!D302","v":0},{"$f":"IF(Tareas!$Y$1,Alumnos!E302*(30/Tareas!$Y$1),\"\")","v":0},{"$f":"Alumnos!F302","v":0},{"$f":"Alumnos!G302","v":0},{"$f":"Alumnos!H302","v":0},null,0,0,null,0]
[null,{"$f":"IF(Alumnos!B303<>\"\",Alumnos!B303,\"\")","v":""},{"$f":"IF(Tareas!$W$1,Alumnos!C303*(30/Tareas!$W$1),\"\")","v":0},{"$f":"Alumnos!D303","v":0},{"$f":"IF(Tareas!$Y$1,Alumnos!E303*(30/Tareas!$Y$1),\"\")","v":0},{"$f":"Alumnos!F303","v":0},{"$f":"Alumnos!G303","v":0},{"$f":"Alumnos!H303","v":0},null,0,0,null,0]
[null,{"$f":"IF(Alumnos!B304<>\"\",Alumnos!B304,\"\")","v":""},{"$f":"IF(Tareas!$W$1,Alumnos!C304*(30/Tareas!$W$1),\"\")","v":0},{"$f":"Alumnos!D304","v":0},{"$f":"IF(Tareas!$Y$1,Alumnos!E304*(30/Tareas!$Y$1),\"\")","v":0},{"$f":"Alumnos!F304","v":0},{"$f":"Alumnos!G304","v":0},{"$f":"Alumnos!H304","v":0},null,0,0,null,0]
[null,{"$f":"IF(Alumnos!B305<>\"\",Alumnos!B305,\"\")","v":""},{"$f":"IF(Tareas!$W$1,Alumnos!C305*(30/Tareas!$W$1),\"\")","v":0},{"$f":"Alumnos!D305","v":0},{"$f":"IF(Tareas!$Y$1,Alumnos!E305*(30/Tareas!$Y$1),\"\")","v":0},{"$f":"Alumnos!F305","v":0},{"$f":"Alumnos!G305","v":0},{"$f":"Alumnos!H305","v":0},null,0,0,null,0]
[null,{"$f":"IF(Alumnos!B306<>\"\",Alumnos!B306,\"\")","v":""},{"$f":"IF(Tareas!$W$1,Alumnos!C306*(30/Tareas!$W$1),\"\")","v":0},{"$f":"Alumnos!D306","v":0},{"$f":"IF(Tareas!$Y$1,Alumnos!E306*(30/Tareas!$Y$1),\"\")","v":0},{"$f":"Alumnos!F306","v":0},{"$f":"Alumnos!G306","v":0},{"$f":"Alumnos!H306","v":0},null,0,0,null,0]
[null,{"$f":"IF(Alumnos!B307<>\"\",Alumnos!B307,\"\")","v":""},{"$f":"IF(Tareas!$W$1,Alumnos!C307*(30/Tareas!$W$1),\"\")","v":0},{"$f":"Alumnos!D307","v":0},{"$f":"IF(Tareas!$Y$1,Alumnos!E307*(30/Tareas!$Y$1),\"\")","v":0},{"$f":"Alumnos!F307","v":0},{"$f":"Alumnos!G307","v":0},{"$f":"Alumnos!H307","v":0},null,0,0,null,0]
[null,{"$f":"IF(Alumnos!B308<>\"\",Alumnos!B308,\"\")","v":""},{"$f":"IF(Tareas!$W$1,Alumnos!C308*(30/Tareas!$W$1),\"\")","v":0},{"$f":"Alumnos!D308","v":0},{"$f":"IF(Tareas!$Y$1,Alumnos!E308*(30/Tareas!$Y$1),\"\")","v":0},{"$f":"Alumnos!F308","v":0},{"$f":"Alumnos!G308","v":0},{"$f":"Alumnos!H308","v":0},null,0,0,null,0]
[null,{"$f":"IF(Alumnos!B309<>\"\",Alumnos!B309,\"\")","v":""},{"$f":"IF(Tareas!$W$1,Alumnos!C309*(30/Tareas!$W$1),\"\")","v":0},{"$f":"Alumnos!D309","v":0},{"$f":"IF(Tareas!$Y$1,Alumnos!E309*(30/Tareas!$Y$1),\"\")","v":0},{"$f":"Alumnos!F309","v":0},{"$f":"Alumnos!G309","v":0},{"$f":"Alumnos!H309","v":0},null,0,0,null,0]
[null,{"$f":"IF(Alumnos!B310<>\"\",Alumnos!B310,\"\")","v":""},{"$f":"IF(Tareas!$W$1,Alumnos!C310*(30/Tareas!$W$1),\"\")","v":0},{"$f":"Alumnos!D310","v":0},{"$f":"IF(Tareas!$Y$1,Alumnos!E310*(30/Tareas!$Y$1),\"\")","v":0},{"$f":"Alumnos!F310","v":0},{"$f":"Alumnos!G310","v":0},{"$f":"Alumnos!H310","v":0},null,0,0,null,0]
[null,{"$f":"IF(Alumnos!B311<>\"\",Alumnos!B311,\"\")","v":""},{"$f":"IF(Tareas!$W$1,Alumnos!C311*(30/Tareas!$W$1),\"\")","v":0},{"$f":"Alumnos!D311","v":0},{"$f":"IF(Tareas!$Y$1,Alumnos!E311*(30/Tareas!$Y$1),\"\")","v":0},{"$f":"Alumnos!F311","v":0},{"$f":"Alumnos!G311","v":0},{"$f":"Alumnos!H311","v":0},null,0,0,null,0]
[null,{"$f":"IF(Alumnos!B312<>\"\",Alumnos!B312,\"\")","v":""},{"$f":"IF(Tareas!$W$1,Alumnos!C312*(30/Tareas!$W$1),\"\")","v":0},{"$f":"Alumnos!D312","v":0},{"$f":"IF(Tareas!$Y$1,Alumnos!E312*(30/Tareas!$Y$1),\"\")","v":0},{"$f":"Alumnos!F312","v":0},{"$f":"Alumnos!G312","v":0},{"$f":"Alumnos!H312","v":0},null,0,0,null,0]
[null,{"$f":"IF(Alumnos!B313<>\"\",Alumnos!B313,\"\")","v":""},{"$f":"IF(Tareas!$W$1,Alumnos!C313*(30/Tareas!$W$1),\"\")","v":0},{"$f":"Alumnos!D313","v":0},{"$f":"IF(Tareas!$Y$1,Alumnos!E313*(30/Tareas!$Y$1),\"\")","v":0},{"$f":"Alumnos!F313","v":0},{"$f":"Alumnos!G313","v":0},{"$f":"Alumnos!H313","v":0},null,0,0,null,0]
[null,{"$f":"IF(Alumnos!B314<>\"\",Alumnos!B314,\"\")","v":""},{"$f":"IF(Tareas!$W$1,Alumnos!C314*(30/Tareas!$W$1),\"\")","v":0},{"$f":"Alumnos!D314","v":0},{"$f":"IF(Tareas!$Y$1,Alumnos!E314*(30/Tareas!$Y$1),\"\")","v":0},{"$f":"Alumnos!F314","v":0},{"$f":"Alumnos!G314","v":0},{"$f":"Alumnos!H314","v":0},null,0,0,null,0]
[null,{"$f":"IF(Alumnos!B315<>\"\",Alumnos!B315,\"\")","v":""},{"$f":"IF(Tareas!$W$1,Alumnos!C315*(30/Tareas!$W$1),\"\")","v":0},{"$f":"Alumnos!D315","v":0},{"$f":"IF(Tareas!$Y$1,Alumnos!E315*(30/Tareas!$Y$1),\"\")","v":0},{"$f":"Alumnos!F315","v":0},{"$f":"Alumnos!G315","v":0},{"$f":"Alumnos!H315","v":0},null,0,0,null,0]
[null,{"$f":"IF(Alumnos!B316<>\"\",Alumnos!B316,\"\")","v":""},{"$f":"IF(Tareas!$W$1,Alumnos!C316*(30/Tareas!$W$1),\"\")","v":0},{"$f":"Alumnos!D316","v":0},{"$f":"IF(Tareas!$Y$1,Alumnos!E316*(30/Tareas!$Y$1),\"\")","v":0},{"$f":"Alumnos!F316","v":0},{"$f":"Alumnos!G316","v":0},{"$f":"Alumnos!H316","v":0},null,0,0,null,0]
[null,{"$f":"IF(Alumnos!B317<>\"\",Alumnos!B317,\"\")","v":""},{"$f":"IF(Tareas!$W$1,Alumnos!C317*(30/Tareas!$W$1),\"\")","v":0},{"$f":"Alumnos!D317","v":0},{"$f":"IF(Tareas!$Y$1,Alumnos!E317*(30/Tareas!$Y$1),\"\")","v":0},{"$f":"Alumnos!F317","v":0},{"$f":"Alumnos!G317","v":0},{"$f":"Alumnos!H317","v":0},null,0,0,null,0]
[null,{"$f":"IF(Alumnos!B318<>\"\",Alumnos!B318,\"\")","v":""},{"$f":"IF(Tareas!$W$1,Alumnos!C318*(30/Tareas!$W$1),\"\")","v":0},{"$f":"Alumnos!D318","v":0},{"$f":"IF(Tareas!$Y$1,Alumnos!E318*(30/Tareas!$Y$1),\"\")","v":0},{"$f":"Alumnos!F318","v":0},{"$f":"Alumnos!G318","v":0},{"$f":"Alumnos!H318","v":0},null,0,0,null,0]
[null,{"$f":"IF(Alumnos!B319<>\"\",Alumnos!B319,\"\")","v":""},{"$f":"IF(Tareas!$W$1,Alumnos!C319*(30/Tareas!$W$1),\"\")","v":0},{"$f":"Alumnos!D319","v":0},{"$f":"IF(Tareas!$Y$1,Alumnos!E319*(30/Tareas!$Y$1),\"\")","v":0},{"$f":"Alumnos!F319","v":0},{"$f":"Alumnos!G319","v":0},{"$f":"Alumnos!H319","v":0},null,0,0,null,0]
[null,{"$f":"IF(Alumnos!B320<>\"\",Alumnos!B320,\"\")","v":""},{"$f":"IF(Tareas!$W$1,Alumnos!C320*(30/Tareas!$W$1),\"\")","v":0},{"$f":"Alumnos!D320","v":0},{"$f":"IF(Tareas!$Y$1,Alumnos!E320*(30/Tareas!$Y$1),\"\")","v":0},{"$f":"Alumnos!F320","v":0},{"$f":"Alumnos!G320","v":0},{"$f":"Alumnos!H320","v":0},null,0,0,null,0]
[null,{"$f":"IF(Alumnos!B321<>\"\",Alumnos!B321,\"\")","v":""},{"$f":"IF(Tareas!$W$1,Alumnos!C321*(30/Tareas!$W$1),\"\")","v":0},{"$f":"Alumnos!D321","v":0},{"$f":"IF(Tareas!$Y$1,Alumnos!E321*(30/Tareas!$Y$1),\"\")","v":0},{"$f":"Alumnos!F321","v":0},{"$f":"Alumnos!G321","v":0},{"$f":"Alumnos!H321","v":0},null,0,0,null,0]
[null,{"$f":"IF(Alumnos!B322<>\"\",Alumnos!B322,\"\")","v":""},{"$f":"IF(Tareas!$W$1,Alumnos!C322*(30/Tareas!$W$1),\"\")","v":0},{"$f":"Alumnos!D322","v":0},{"$f":"IF(Tareas!$Y$1,Alumnos!E322*(30/Tareas!$Y$1),\"\")","v":0},{"$f":"Alumnos!F322","v":0},{"$f":"Alumnos!G322","v":0},{"$f":"Alumnos!H322","v":0},null,0,0,null,0]
[null,{"$f":"IF(Alumnos!B323<>\"\",Alumnos!B323,\"\")","v":""},{"$f":"IF(Tareas!$W$1,Alumnos!C323*(30/Tareas!$W$1),\"\")","v":0},{"$f":"Alumnos!D323","v":0},{"$f":"IF(Tareas!$Y$1,Alumnos!E323*(30/Tareas!$Y$1),\"\")","v":0},{"$f":"Alumnos!F323","v":0},{"$f":"Alumnos!G323","v":0},{"$f":"Alumnos!H323","v":0},null,{"$f":"SUM(C323:F323)","v":0},{"$f":"SUM(G323:H323)","v":0},null,{"$f":"(J323+K323)/2","v":0}]
[null,{"$f":"IF(Alumnos!B324<>\"\",Alumnos!B324,\"\")","v":""},{"$f":"IF(Tareas!$W$1,Alumnos!C324*(30/Tareas!$W$1),\"\")","v":0},{"$f":"Alumnos!D324","v":0},{"$f":"IF(Tareas!$Y$1,Alumnos!E324*(30/Tareas!$Y$1),\"\")","v":0},{"$f":"Alumnos!F324","v":0},{"$f":"Alumnos!G324","v":0},{"$f":"Alumnos!H324","v":0},null,0,0,null,0]
[null,{"$f":"IF(Alumnos!B325<>\"\",Alumnos!B325,\"\")","v":""},{"$f":"IF(Tareas!$W$1,Alumnos!C325*(30/Tareas!$W$1),\"\")","v":0},{"$f":"Alumnos!D325","v":0},{"$f":"IF(Tareas!$Y$1,Alumnos!E325*(30/Tareas!$Y$1),\"\")","v":0},{"$f":"Alumnos!F325","v":0},{"$f":"Alumnos!G325","v":0},{"$f":"Alumnos!H325","v":0},null,0,0,null,0]
[null,{"$f":"IF(Alumnos!B326<>\"\",Alumnos!B326,\"\")","v":""},{"$f":"IF(Tareas!$W$1,Alumnos!C326*(30/Tareas!$W$1),\"\")","v":0},{"$f":"Alumnos!D326","v":0},{"$f":"IF(Tareas!$Y$1,Alumnos!E326*(30/Tareas!$Y$1),\"\")","v":0},{"$f":"Alumnos!F326","v":0},{"$f":"Alumnos!G326","v":0},{"$f":"Alumnos!H326","v":0},null,0,0,null,0]
[null,{"$f":"IF(Alumnos!B327<>\"\",Alumnos!B327,\"\")","v":""},{"$f":"IF(Tareas!$W$1,Alumnos!C327*(30/Tareas!$W$1),\"\")","v":0},{"$f":"Alumnos!D327","v":0},{"$f":"IF(Tareas!$Y$1,Alumnos!E327*(30/Tareas!$Y$1),\"\")","v":0},{"$f":"Alumnos!F327","v":0},{"$f":"Alumnos!G327","v":0},{"$f":"Alumnos!H327","v":0},null,0,0,null,0]
[null,{"$f":"IF(Alumnos!B328<>\"\",Alumnos!B328,\"\")","v":""},{"$f":"IF(Tareas!$W$1,Alumnos!C328*(30/Tareas!$W$1),\"\")","v":0},{"$f":"Alumnos!D328","v":0},{"$f":"IF(Tareas!$Y$1,Alumnos!E328*(30/Tareas!$Y$1),\"\")","v":0},{"$f":"Alumnos!F328","v":0},{"$f":"Alumnos!G328","v":0},{"$f":"Alumnos!H328","v":0},null,0,0,null,0]
[null,{"$f":"IF(Alumnos!B329<>\"\",Alumnos!B329,\"\")","v":""},{"$f":"IF(Tareas!$W$1,Alumnos!C329*(30/Tareas!$W$1),\"\")","v":0},{"$f":"Alumnos!D329","v":0},{"$f":"IF(Tareas!$Y$1,Alumnos!E329*(30/Tareas!$Y$1),\"\")","v":0},{"$f":"Alumnos!F329","v":0},{"$f":"Alumnos!G329","v":0},{"$f":"Alumnos!H329","v":0},null,0,0,null,0]
[null,{"$f":"IF(Alumnos!B330<>\"\",Alumnos!B330,\"\")","v":""},{"$f":"IF(Tareas!$W$1,Alumnos!C330*(30/Tareas!$W$1),\"\")","v":0},{"$f":"Alumnos!D330","v":0},{"$f":"IF(Tareas!$Y$1,Alumnos!E330*(30/Tareas!$Y$1),\"\")","v":0},{"$f":"Alumnos!F330","v":0},{"$f":"Alumnos!G330","v":0},{"$f":"Alumnos!H330","v":0},null,0,0,null,0]
[null,{"$f":"IF(Alumnos!B331<>\"\",Alumnos!B331,\"\")","v":""},{"$f":"IF(Tareas!$W$1,Alumnos!C331*(30/Tareas!$W$1),\"\")","v":0},{"$f":"Alumnos!D331","v":0},{"$f":"IF(Tareas!$Y$1,Alumnos!E331*(30/Tareas!$Y$1),\"\")","v":0},{"$f":"Alumnos!F331","v":0},{"$f":"Alumnos!G331","v":0},{"$f":"Alumnos!H331","v":0},null,0,0,null,0]
[null,{"$f":"IF(Alumnos!B332<>\"\",Alumnos!B332,\"\")","v":""},{"$f":"IF(Tareas!$W$1,Alumnos!C332*(30/Tareas!$W$1),\"\")","v":0},{"$f":"Alumnos!D332","v":0},{"$f":"IF(Tareas!$Y$1,Alumnos!E332*(30/Tareas!$Y$1),\"\")","v":0},{"$f":"Alumnos!F332","v":0},{"$f":"Alumnos!G332","v":0},{"$f":"Alumnos!H332","v":0},null,0,0,null,0]
[null,{"$f":"IF(Alumnos!B333<>\"\",Alumnos!B333,\"\")","v":""},{"$f":"IF(Tareas!$W$1,Alumnos!C333*(30/Tareas!$W$1),\"\")","v":0},{"$f":"Alumnos!D333","v":0},{"$f":"IF(Tareas!$Y$1,Alumnos!E333*(30/Tareas!$Y$1),\"\")","v":0},{"$f":"Alumnos!F333","v":0},{"$f":"Alumnos!G333","v":0},{"$f":"Alumnos!H333","v":0},null,0,0,null,0]
[null,{"$f":"IF(Alumnos!B334<>\"\",Alumnos!B334,\"\")","v":""},{"$f":"IF(Tareas!$W$1,Alumnos!C334*(30/Tareas!$W$1),\"\")","v":0},{"$f":"Alumnos!D334","v":0},{"$f":"IF(Tareas!$Y$1,Alumnos!E334*(30/Tareas!$Y$1),\"\")","v":0},{"$f":"Alumnos!F334","v":0},{"$f":"Alumnos!G334","v":0},{"$f":"Alumnos!H334","v":0},null,0,0,null,0]
[null,{"$f":"IF(Alumnos!B335<>\"\",Alumnos!B335,\"\")","v":""},{"$f":"IF(Tareas!$W$1,Alumnos!C335*(30/Tareas!$W$1),\"\")","v":0},{"$f":"Alumnos!D335","v":0},{"$f":"IF(Tareas!$Y$1,Alumnos!E335*(30/Tareas!$Y$1),\"\")","v":0},{"$f":"Alumnos!F335","v":0},{"$f":"Alumnos!G335","v":0},{"$f":"Alumnos!H335","v":0},null,0,0,null,0]
[null,{"$f":"IF(Alumnos!B336<>\"\",Alumnos!B336,\"\")","v":""},{"$f":"IF(Tareas!$W$1,Alumnos!C336*(30/Tareas!$W$1),\"\")","v":0},{"$f":"Alumnos!D336","v":0},{"$f":"IF(Tareas!$Y$1,Alumnos!E336*(30/Tareas!$Y$1),\"\")","v":0},{"$f":"Alumnos!F336","v":0},{"$f":"Alumnos!G336","v":0},{"$f":"Alumnos!H336","v":0},null,0,0,null,0]
[null,{"$f":"IF(Alumnos!B337<>\"\",Alumnos!B337,\"\")","v":""},{"$f":"IF(Tareas!$W$1,Alumnos!C337*(30/Tareas!$W$1),\"\")","v":0},{"$f":"Alumnos!D337","v":0},{"$f":"IF(Tareas!$Y$1,Alumnos!E337*(30/Tareas!$Y$1),\"\")","v":0},{"$f":"Alumnos!F337","v":0},{"$f":"Alumnos!G337","v":0},{"$f":"Alumnos!H337","v":0},null,0,0,null,0]
[null,{"$f":"IF(Alumnos!B338<>\"\",Alumnos!B338,\"\")","v":""},{"$f":"IF(Tareas!$W$1,Alumnos!C338*(30/Tareas!$W$1),\"\")","v":0},{"$f":"Alumnos!D338","v":0},{"$f":"IF(Tareas!$Y$1,Alumnos!E338*(30/Tareas!$Y$1),\"\")","v":0},{"$f":"Alumnos!F338","v":0},{"$f":"Alumnos!G338","v":0},{"$f":"Alumnos!H338","v":0},null,0,0,null,0]
[null,{"$f":"IF(Alumnos!B339<>\"\",Alumnos!B339,\"\")","v":""},{"$f":"IF(Tareas!$W$1,Alumnos!C339*(30/Tareas!$W$1),\"\")","v":0},{"$f":"Alumnos!D339","v":0},{"$f":"IF(Tareas!$Y$1,Alumnos!E339*(30/Tareas!$Y$1),\"\")","v":0},{"$f":"Alumnos!F339","v":0},{"$f":"Alumnos!G339","v":0},{"$f":"Alumnos!H339","v":0},null,0,0,null,0]
[null,{"$f":"IF(Alumnos!B340<>\"\",Alumnos!B340,\"\")","v":""},{"$f":"IF(Tareas!$W$1,Alumnos!C340*(30/Tareas!$W$1),\"\")","v":0},{"$f":"Alumnos!D340","v":0},{"$f":"IF(Tareas!$Y$1,Alumnos!E340*(30/Tareas!$Y$1),\"\")","v":0},{"$f":"Alumnos!F340","v":0},{"$f":"Alumnos!G340","v":0},{"$f":"Alumnos!H340","v":0},null,0,0,null,0]
[null,{"$f":"IF(Alumnos!B341<>\"\",Alumnos!B341,\"\")","v":""},{"$f":"IF(Tareas!$W$1,Alumnos!C341*(30/Tareas!$W$1),\"\")","v":0},{"$f":"Alumnos!D341","v":0},{"$f":"IF(Tareas!$Y$1,Alumnos!E341*(30/Tareas!$Y$1),\"\")","v":0},{"$f":"Alumnos!F341","v":0},{"$f":"Alumnos!G341","v":0},{"$f":"Alumnos!H341","v":0},null,0,0,null,0]
[null,{"$f":"IF(Alumnos!B342<>\"\",Alumnos!B342,\"\")","v":""},{"$f":"IF(Tareas!$W$1,Alumnos!C342*(30/Tareas!$W$1),\"\")","v":0},{"$f":"Alumnos!D342","v":0},{"$f":"IF(Tareas!$Y$1,Alumnos!E342*(30/Tareas!$Y$1),\"\")","v":0},{"$f":"Alumnos!F342","v":0},{"$f":"Alumnos!G342","v":0},{"$f":"Alumnos!H342","v":0},null,0,0,null,0]
[null,{"$f":"IF(Alumnos!B343<>\"\",Alumnos!B343,\"\")","v":""},{"$f":"IF(Tareas!$W$1,Alumnos!C343*(30/Tareas!$W$1),\"\")","v":0},{"$f":"Alumnos!D343","v":0},{"$f":"IF(Tareas!$Y$1,Alumnos!E343*(30/Tareas!$Y$1),\"\")","v":0},{"$f":"Alumnos!F343","v":0},{"$f":"Alumnos!G343","v":0},{"$f":"Alumnos!H343","v":0},null,0,0,null,0]
[null,{"$f":"IF(Alumnos!B344<>\"\",Alumnos!B344,\"\")","v":""},{"$f":"IF(Tareas!$W$1,Alumnos!C344*(30/Tareas!$W$1),\"\")","v":0},{"$f":"Alumnos!D344","v":0},{"$f":"IF(Tareas!$Y$1,Alumnos!E344*(30/Tareas!$Y$1),\"\")","v":0},{"$f":"Alumnos!F344","v":0},{"$f":"Alumnos!G344","v":0},{"$f":"Alumnos!H344","v":0},null,0,0,null,0]
[null,{"$f":"IF(Alumnos!B345<>\"\",Alumnos!B345,\"\")","v":""},{"$f":"IF(Tareas!$W$1,Alumnos!C345*(30/Tareas!$W$1),\"\")","v":0},{"$f":"Alumnos!D345","v":0},{"$f":"IF(Tareas!$Y$1,Alumnos!E345*(30/Tareas!$Y$1),\"\")","v":0},{"$f":"Alumnos!F345","v":0},{"$f":"Alumnos!G345","v":0},{"$f":"Alumnos!H345","v":0},null,0,0,null,0]
[null,{"$f":"IF(Alumnos!B346<>\"\",Alumnos!B346,\"\")","v":""},{"$f":"IF(Tareas!$W$1,Alumnos!C346*(30/Tareas!$W$1),\"\")","v":0},{"$f":"Alumnos!D346","v":0},{"$f":"IF(Tareas!$Y$1,Alumnos!E346*(30/Tareas!$Y$1),\"\")","v":0},{"$f":"Alumnos!F346","v":0},{"$f":"Alumnos!G346","v":0},{"$f":"Alumnos!H346","v":0},null,0,0,null,0]
[null,{"$f":"IF(Alumnos!B347<>\"\",Alumnos!B347,\"\")","v":""},{"$f":"IF(Tareas!$W$1,Alumnos!C347*(30/Tareas!$W$1),\"\")","v":0},{"$f":"Alumnos!D347","v":0},{"$f":"IF(Tareas!$Y$1,Alumnos!E347*(30/Tareas!$Y$1),\"\")","v":0},{"$f":"Alumnos!F347","v":0},{"$f":"Alumnos!G347","v":0},{"$f":"Alumnos!H347","v":0},null,0,0,null,0]
[null,{"$f":"IF(Alumnos!B348<>\"\",Alumnos!B348,\"\")","v":""},{"$f":"IF(Tareas!$W$1,Alumnos!C348*(30/Tareas!$W$1),\"\")","v":0},{"$f":"Alumnos!D348","v":0},{"$f":"IF(Tareas!$Y$1,Alumnos!E348*(30/Tareas!$Y$1),\"\")","v":0},{"$f":"Alumnos!F348","v":0},{"$f":"Alumnos!G348","v":0},{"$f":"Alumnos!H348","v":0},null,0,0,null,0]
[null,{"$f":"IF(Alumnos!B349<>\"\",Alumnos!B349,\"\")","v":""},{"$f":"IF(Tareas!$W$1,Alumnos!C349*(30/Tareas!$W$1),\"\")","v":0},{"$f":"Alumnos!D349","v":0},{"$f":"IF(Tareas!$Y$1,Alumnos!E349*(30/Tareas!$Y$1),\"\")","v":0},{"$f":"Alumnos!F349","v":0},{"$f":"Alumnos!G349","v":0},{"$f":"Alumnos!H349","v":0},null,0,0,null,0]
[null,{"$f":"IF(Alumnos!B350<>\"\",Alumnos!B350,\"\")","v":""},{"$f":"IF(Tareas!$W$1,Alumnos!C350*(30/Tareas!$W$1),\"\")","v":0},{"$f":"Alumnos!D350","v":0},{"$f":"IF(Tareas!$Y$1,Alumnos!E350*(30/Tareas!$Y$1),\"\")","v":0},{"$f":"Alumnos!F350","v":0},{"$f":"Alumnos!G350","v":0},{"$f":"Alumnos!H350","v":0},null,0,0,null,0]
[null,{"$f":"IF(Alumnos!B351<>\"\",Alumnos!B351,\"\")","v":""},{"$f":"IF(Tareas!$W$1,Alumnos!C351*(30/Tareas!$W$1),\"\")","v":0},{"$f":"Alumnos!D351","v":0},{"$f":"IF(Tareas!$Y$1,Alumnos!E351*(30/Tareas!$Y$1),\"\")","v":0},{"$f":"Alumnos!F351","v":0},{"$f":"Alumnos!G351","v":0},{"$f":"Alumnos!H351","v":0},null,0,0,null,0]
[null,{"$f":"IF(Alumnos!B352<>\"\",Alumnos!B352,\"\")","v":""},{"$f":"IF(Tareas!$W$1,Alumnos!C352*(30/Tareas!$W$1),\"\")","v":0},{"$f":"Alumnos!D352","v":0},{"$f":"IF(Tareas!$Y$1,Alumnos!E352*(30/Tareas!$Y$1),\"\")","v":0},{"$f":"Alumnos!F352","v":0},{"$f":"Alumnos!G352","v":0},{"$f":"Alumnos!H352","v":0},null,0,0,null,0]
[null,{"$f":"IF(Alumnos!B353<>\"\",Alumnos!B353,\"\")","v":""},{"$f":"IF(Tareas!$W$1,Alumnos!C353*(30/Tareas!$W$1),\"\")","v":0},{"$f":"Alumnos!D353","v":0},{"$f":"IF(Tareas!$Y$1,Alumnos!E353*(30/Tareas!$Y$1),\"\")","v":0},{"$f":"Alumnos!F353","v":0},{"$f":"Alumnos!G353","v":0},{"$f":"Alumnos!H353","v":0},null,0,0,null,0]
[null,{"$f":"IF(Alumnos!B354<>\"\",Alumnos!B354,\"\")","v":""},{"$f":"IF(Tareas!$W$1,Alumnos!C354*(30/Tareas!$W$1),\"\")","v":0},{"$f":"Alumnos!D354","v":0},{"$f":"IF(Tareas!$Y$1,Alumnos!E354*(30/Tareas!$Y$1),\"\")","v":0},{"$f":"Alumnos!F354","v":0},{"$f":"Alumnos!G354","v":0},{"$f":"Alumnos!H354","v":0},null,0,0,null,0]
[null,{"$f":"IF(Alumnos!B355<>\"\",Alumnos!B355,\"\")","v":""},{"$f":"IF(Tareas!$W$1,Alumnos!C355*(30/Tareas!$W$1),\"\")","v":0},{"$f":"Alumnos!D355","v":0},{"$f":"IF(Tareas!$Y$1,Alumnos!E355*(30/Tareas!$Y$1),\"\")","v":0},{"$f":"Alumnos!F355","v":0},{"$f":"Alumnos!G355","v":0},{"$f":"Alumnos!H355","v":0},null,0,0,null,0]
[null,{"$f":"IF(Alumnos!B356<>\"\",Alumnos!B356,\"\")","v":""},{"$f":"IF(Tareas!$W$1,Alumnos!C356*(30/Tareas!$W$1),\"\")","v":0},{"$f":"Alumnos!D356","v":0},{"$f":"IF(Tareas!$Y$1,Alumnos!E356*(30/Tareas!$Y$1),\"\")","v":0},{"$f":"Alumnos!F356","v":0},{"$f":"Alumnos!G356","v":0},{"$f":"Alumnos!H356","v":0},null,0,0,null,0]
[null,{"$f":"IF(Alumnos!B357<>\"\",Alumnos!B357,\"\")","v":""},{"$f":"IF(Tareas!$W$1,Alumnos!C357*(30/Tareas!$W$1),\"\")","v":0},{"$f":"Alumnos!D357","v":0},{"$f":"IF(Tareas!$Y$1,Alumnos!E357*(30/Tareas!$Y$1),\"\")","v":0},{"$f":"Alumnos!F357","v":0},{"$f":"Alumnos!G357","v":0},{"$f":"Alumnos!H357","v":0},null,0,0,null,0]
[null,{"$f":"IF(Alumnos!B358<>\"\",Alumnos!B358,\"\")","v":""},{"$f":"IF(Tareas!$W$1,Alumnos!C358*(30/Tareas!$W$1),\"\")","v":0},{"$f":"Alumnos!D358","v":0},{"$f":"IF(Tareas!$Y$1,Alumnos!E358*(30/Tareas!$Y$1),\"\")","v":0},{"$f":"Alumnos!F358","v":0},{"$f":"Alumnos!G358","v":0},{"$f":"Alumnos!H358","v":0},null,0,0,null,0]
[null,{"$f":"IF(Alumnos!B359<>\"\",Alumnos!B359,\"\")","v":""},{"$f":"IF(Tareas!$W$1,Alumnos!C359*(30/Tareas!$W$1),\"\")","v":0},{"$f":"Alumnos!D359","v":0},{"$f":"IF(Tareas!$Y$1,Alumnos!E359*(30/Tareas!$Y$1),\"\")","v":0},{"$f":"Alumnos!F359","v":0},{"$f":"Alumnos!G359","v":0},{"$f":"Alumnos!H359","v":0},null,0,0,null,0]
[null,{"$f":"IF(Alumnos!B360<>\"\",Alumnos!B360,\"\")","v":""},{"$f":"IF(Tareas!$W$1,Alumnos!C360*(30/Tareas!$W$1),\"\")","v":0},{"$f":"Alumnos!D360","v":0},{"$f":"IF(Tareas!$Y$1,Alumnos!E360*(30/Tareas!$Y$1),\"\")","v":0},{"$f":"Alumnos!F360","v":0},{"$f":"Alumnos!G360","v":0},{"$f":"Alumnos!H360","v":0},null,0,0,null,0]
[null,{"$f":"IF(Alumnos!B361<>\"\",Alumnos!B361,\"\")","v":""},{"$f":"IF(Tareas!$W$1,Alumnos!C361*(30/Tareas!$W$1),\"\")","v":0},{"$f":"Alumnos!D361","v":0},{"$f":"IF(Tareas!$Y$1,Alumnos!E361*(30/Tareas!$Y$1),\"\")","v":0},{"$f":"Alumnos!F361","v":0},{"$f":"Alumnos!G361","v":0},{"$f":"Alumnos!H361","v":0},null,0,0,null,0]
[null,{"$f":"IF(Alumnos!B362<>\"\",Alumnos!B362,\"\")","v":""},{"$f":"IF(Tareas!$W$1,Alumnos!C362*(30/Tareas!$W$1),\"\")","v":0},{"$f":"Alumnos!D362","v":0},{"$f":"IF(Tareas!$Y$1,Alumnos!E362*(30/Tareas!$Y$1),\"\")","v":0},{"$f":"Alumnos!F362","v":0},{"$f":"Alumnos!G362","v":0},{"$f":"Alumnos!H362","v":0},null,0,0,null,0]
[null,{"$f":"IF(Alumnos!B363<>\"\",Alumnos!B363,\"\")","v":""},{"$f":"IF(Tareas!$W$1,Alumnos!C363*(30/Tareas!$W$1),\"\")","v":0},{"$f":"Alumnos!D363","v":0},{"$f":"IF(Tareas!$Y$1,Alumnos!E363*(30/Tareas!$Y$1),\"\")","v":0},{"$f":"Alumnos!F363","v":0},{"$f":"Alumnos!G363","v":0},{"$f":"Alumnos!H363","v":0},null,0,0,null,0]
[null,{"$f":"IF(Alumnos!B364<>\"\",Alumnos!B364,\"\")","v":""},{"$f":"IF(Tareas!$W$1,Alumnos!C364*(30/Tareas!$W$1),\"\")","v":0},{"$f":"Alumnos!D364","v":0},{"$f":"IF(Tareas!$Y$1,Alumnos!E364*(30/Tareas!$Y$1),\"\")","v":0},{"$f":"Alumnos!F364","v":0},{"$f":"Alumnos!G364","v":0},{"$f":"Alumnos!H364","v":0},null,0,0,null,0]
[null,{"$f":"IF(Alumnos!B365<>\"\",Alumnos!B365,\"\")","v":""},{"$f":"IF(Tareas!$W$1,Alumnos!C365*(30/Tareas!$W$1),\"\")","v":0},{"$f":"Alumnos!D365","v":0},{"$f":"IF(Tareas!$Y$1,Alumnos!E365*(30/Tareas!$Y$1),\"\")","v":0},{"$f":"Alumnos!F365","v":0},{"$f":"Alumnos!G365","v":0},{"$f":"Alumnos!H365","v":0},null,0,0,null,0]
[null,{"$f":"IF(Alumnos!B366<>\"\",Alumnos!B366,\"\")","v":""},{"$f":"IF(Tareas!$W$1,Alumnos!C366*(30/Tareas!$W$1),\"\")","v":0},{"$f":"Alumnos!D366","v":0},{"$f":"IF(Tareas!$Y$1,Alumnos!E366*(30/Tareas!$Y$1),\"\")","v":0},{"$f":"Alumnos!F366","v":0},{"$f":"Alumnos!G366","v":0},{"$f":"Alumnos!H366","v":0},null,0,0,null,0]
[null,{"$f":"IF(Alumnos!B367<>\"\",Alumnos!B367,\"\")","v":""},{"$f":"IF(Tareas!$W$1,Alumnos!C367*(30/Tareas!$W$1),\"\")","v":0},{"$f":"Alumnos!D367","v":0},{"$f":"IF(Tareas!$Y$1,Alumnos!E367*(30/Tareas!$Y$1),\"\")","v":0},{"$f":"Alumnos!F367","v":0},{"$f":"Alumnos!G367","v":0},{"$f":"Alumnos!H367","v":0},null,0,0,null,0]
[null,{"$f":"IF(Alumnos!B368<>\"\",Alumnos!B368,\"\")","v":""},{"$f":"IF(Tareas!$W$1,Alumnos!C368*(30/Tareas!$W$1),\"\")","v":0},{"$f":"Alumnos!D368","v":0},{"$f":"IF(Tareas!$Y$1,Alumnos!E368*(30/Tareas!$Y$1),\"\")","v":0},{"$f":"Alumnos!F368","v":0},{"$f":"Alumnos!G368","v":0},{"$f":"Alumnos!H368","v":0},null,0,0,null,0]
[null,{"$f":"IF(Alumnos!B369<>\"\",Alumnos!B369,\"\")","v":""},{"$f":"IF(Tareas!$W$1,Alumnos!C369*(30/Tareas!$W$1),\"\")","v":0},{"$f":"Alumnos!D369","v":0},{"$f":"IF(Tareas!$Y$1,Alumnos!E369*(30/Tareas!$Y$1),\"\")","v":0},{"$f":"Alumnos!F369","v":0},{"$f":"Alumnos!G369","v":0},{"$f":"Alumnos!H369","v":0},null,0,0,null,0]
[null,{"$f":"IF(Alumnos!B370<>\"\",Alumnos!B370,\"\")","v":""},{"$f":"IF(Tareas!$W$1,Alumnos!C370*(30/Tareas!$W$1),\"\")","v":0},{"$f":"Alumnos!D370","v":0},{"$f":"IF(Tareas!$Y$1,Alumnos!E370*(30/Tareas!$Y$1),\"\")","v":0},{"$f":"Alumnos!F370","v":0},{"$f":"Alumnos!G370","v":0},{"$f":"Alumnos!H370","v":0},null,0,0,null,0]
[null,{"$f":"IF(Alumnos!B371<>\"\",Alumnos!B371,\"\")","v":""},{"$f":"IF(Tareas!$W$1,Alumnos!C371*(30/Tareas!$W$1),\"\")","v":0},{"$f":"Alumnos!D371","v":0},{"$f":"IF(Tareas!$Y$1,Alumnos!E371*(30/Tareas!$Y$1),\"\")","v":0},{"$f":"Alumnos!F371","v":0},{"$f":"Alumnos!G371","v":0},{"$f":"Alumnos!H371","v":0},null,0,0,null,0]
[null,{"$f":"IF(Alumnos!B372<>\"\",Alumnos!B372,\"\")","v":""},{"$f":"IF(Tareas!$W$1,Alumnos!C372*(30/Tareas!$W$1),\"\")","v":0},{"$f":"Alumnos!D372","v":0},{"$f":"IF(Tareas!$Y$1,Alumnos!E372*(30/Tareas!$Y$1),\"\")","v":0},{"$f":"Alumnos!F372","v":0},{"$f":"Alumnos!G372","v":0},{"$f":"Alumnos!H372","v":0},null,0,0,null,0]
[null,{"$f":"IF(Alumnos!B373<>\"\",Alumnos!B373,\"\")","v":""},{"$f":"IF(Tareas!$W$1,Alumnos!C373*(30/Tareas!$W$1),\"\")","v":0},{"$f":"Alumnos!D373","v":0},{"$f":"IF(Tareas!$Y$1,Alumnos!E373*(30/Tareas!$Y$1),\"\")","v":0},{"$f":"Alumnos!F373","v":0},{"$f":"Alumnos!G373","v":0},{"$f":"Alumnos!H373","v":0},null,0,0,null,0]
[null,{"$f":"IF(Alumnos!B374<>\"\",Alumnos!B374,\"\")","v":""},{"$f":"IF(Tareas!$W$1,Alumnos!C374*(30/Tareas!$W$1),\"\")","v":0},{"$f":"Alumnos!D374","v":0},{"$f":"IF(Tareas!$Y$1,Alumnos!E374*(30/Tareas!$Y$1),\"\")","v":0},{"$f":"Alumnos!F374","v":0},{"$f":"Alumnos!G374","v":0},{"$f":"Alumnos!H374","v":0},null,0,0,null,0]
[null,{"$f":"IF(Alumnos!B375<>\"\",Alumnos!B375,\"\")","v":""},{"$f":"IF(Tareas!$W$1,Alumnos!C375*(30/Tareas!$W$1),\"\")","v":0},{"$f":"Alumnos!D375","v":0},{"$f":"IF(Tareas!$Y$1,Alumnos!E375*(30/Tareas!$Y$1),\"\")","v":0},{"$f":"Alumnos!F375","v":0},{"$f":"Alumnos!G375","v":0},{"$f":"Alumnos!H375","v":0},null,0,0,null,0]
[null,{"$f":"IF(Alumnos!B376<>\"\",Alumnos!B376,\"\")","v":""},{"$f":"IF(Tareas!$W$1,Alumnos!C376*(30/Tareas!$W$1),\"\")","v":0},{"$f":"Alumnos!D376","v":0},{"$f":"IF(Tareas!$Y$1,Alumnos!E376*(30/Tareas!$Y$1),\"\")","v":0},{"$f":"Alumnos!F376","v":0},{"$f":"Alumnos!G376","v":0},{"$f":"Alumnos!H376","v":0},null,0,0,null,0]
[null,{"$f":"IF(Alumnos!B377<>\"\",Alumnos!B377,\"\")","v":""},{"$f":"IF(Tareas!$W$1,Alumnos!C377*(30/Tareas!$W$1),\"\")","v":0},{"$f":"Alumnos!D377","v":0},{"$f":"IF(Tareas!$Y$1,Alumnos!E377*(30/Tareas!$Y$1),\"\")","v":0},{"$f":"Alumnos!F377","v":0},{"$f":"Alumnos!G377","v":0},{"$f":"Alumnos!H377","v":0},null,0,0,null,0]
[null,{"$f":"IF(Alumnos!B378<>\"\",Alumnos!B378,\"\")","v":""},{"$f":"IF(Tareas!$W$1,Alumnos!C378*(30/Tareas!$W$1),\"\")","v":0},{"$f":"Alumnos!D378","v":0},{"$f":"IF(Tareas!$Y$1,Alumnos!E378*(30/Tareas!$Y$1),\"\")","v":0},{"$f":"Alumnos!F378","v":0},{"$f":"Alumnos!G378","v":0},{"$f":"Alumnos!H378","v":0},null,0,0,null,0]
[null,{"$f":"IF(Alumnos!B379<>\"\",Alumnos!B379,\"\")","v":""},{"$f":"IF(Tareas!$W$1,Alumnos!C379*(30/Tareas!$W$1),\"\")","v":0},{"$f":"Alumnos!D379","v":0},{"$f":"IF(Tareas!$Y$1,Alumnos!E379*(30/Tareas!$Y$1),\"\")","v":0},{"$f":"Alumnos!F379","v":0},{"$f":"Alumnos!G379","v":0},{"$f":"Alumnos!H379","v":0},null,0,0,null,0]
[null,{"$f":"IF(Alumnos!B380<>\"\",Alumnos!B380,\"\")","v":""},{"$f":"IF(Tareas!$W$1,Alumnos!C380*(30/Tareas!$W$1),\"\")","v":0},{"$f":"Alumnos!D380","v":0},{"$f":"IF(Tareas!$Y$1,Alumnos!E380*(30/Tareas!$Y$1),\"\")","v":0},{"$f":"Alumnos!F380","v":0},{"$f":"Alumnos!G380","v":0},{"$f":"Alumnos!H380","v":0},null,0,0,null,0]
[null,{"$f":"IF(Alumnos!B381<>\"\",Alumnos!B381,\"\")","v":""},{"$f":"IF(Tareas!$W$1,Alumnos!C381*(30/Tareas!$W$1),\"\")","v":0},{"$f":"Alumnos!D381","v":0},{"$f":"IF(Tareas!$Y$1,Alumnos!E381*(30/Tareas!$Y$1),\"\")","v":0},{"$f":"Alumnos!F381","v":0},{"$f":"Alumnos!G381","v":0},{"$f":"Alumnos!H381","v":0},null,0,0,null,0]
[null,{"$f":"IF(Alumnos!B382<>\"\",Alumnos!B382,\"\")","v":""},{"$f":"IF(Tareas!$W$1,Alumnos!C382*(30/Tareas!$W$1),\"\")","v":0},{"$f":"Alumnos!D382","v":0},{"$f":"IF(Tareas!$Y$1,Alumnos!E382*(30/Tareas!$Y$1),\"\")","v":0},{"$f":"Alumnos!F382","v":0},{"$f":"Alumnos!G382","v":0},{"$f":"Alumnos!H382","v":0},null,0,0,null,0]
[null,{"$f":"IF(Alumnos!B383<>\"\",Alumnos!B383,\"\")","v":""},{"$f":"IF(Tareas!$W$1,Alumnos!C383*(30/Tareas!$W$1),\"\")","v":0},{"$f":"Alumnos!D383","v":0},{"$f":"IF(Tareas!$Y$1,Alumnos!E383*(30/Tareas!$Y$1),\"\")","v":0},{"$f":"Alumnos!F383","v":0},{"$f":"Alumnos!G383","v":0},{"$f":"Alumnos!H383","v":0},null,0,0,null,0]
[null,{"$f":"IF(Alumnos!B384<>\"\",Alumnos!B384,\"\")","v":""},{"$f":"IF(Tareas!$W$1,Alumnos!C384*(30/Tareas!$W$1),\"\")","v":0},{"$f":"Alumnos!D384","v":0},{"$f":"IF(Tareas!$Y$1,Alumnos!E384*(30/Tareas!$Y$1),\"\")","v":0},{"$f":"Alumnos!F384","v":0},{"$f":"Alumnos!G384","v":0},{"$f":"Alumnos!H384","v":0},null,0,0,null,0]
[null,{"$f":"IF(Alumnos!B385<>\"\",Alumnos!B385,\"\")","v":""},{"$f":"IF(Tareas!$W$1,Alumnos!C385*(30/Tareas!$W$1),\"\")","v":0},{"$f":"Alumnos!D385","v":0},{"$f":"IF(Tareas!$Y$1,Alumnos!E385*(30/Tareas!$Y$1),\"\")","v":0},{"$f":"Alumnos!F385","v":0},{"$f":"Alumnos!G385","v":0},{"$f":"Alumnos!H385","v":0},null,0,0,null,0]
[null,{"$f":"IF(Alumnos!B386<>\"\",Alumnos!B386,\"\")","v":""},{"$f":"IF(Tareas!$W$1,Alumnos!C386*(30/Tareas!$W$1),\"\")","v":0},{"$f":"Alumnos!D386","v":0},{"$f":"IF(Tareas!$Y$1,Alumnos!E386*(30/Tareas!$Y$1),\"\")","v":0},{"$f":"Alumnos!F386","v":0},{"$f":"Alumnos!G386","v":0},{"$f":"Alumnos!H386","v":0},null,0,0,null,0]
[null,{"$f":"IF(Alumnos!B387<>\"\",Alumnos!B387,\"\")","v":""},{"$f":"IF(Tareas!$W$1,Alumnos!C387*(30/Tareas!$W$1),\"\")","v":0},{"$f":"Alumnos!D387","v":0},{"$f":"IF(Tareas!$Y$1,Alumnos!E387*(30/Tareas!$Y$1),\"\")","v":0},{"$f":"Alumnos!F387","v":0},{"$f":"Alumnos!G387","v":0},{"$f":"Alumnos!H387","v":0},null,{"$f":"SUM(C387:F387)","v":0},{"$f":"SUM(G387:H387)","v":0},null,{"$f":"(J387+K387)/2","v":0}]
[null,{"$f":"IF(Alumnos!B388<>\"\",Alumnos!B388,\"\")","v":""},{"$f":"IF(Tareas!$W$1,Alumnos!C388*(30/Tareas!$W$1),\"\")","v":0},{"$f":"Alumnos!D388","v":0},{"$f":"IF(Tareas!$Y$1,Alumnos!E388*(30/Tareas!$Y$1),\"\")","v":0},{"$f":"Alumnos!F388","v":0},{"$f":"Alumnos!G388","v":0},{"$f":"Alumnos!H388","v":0},null,0,0,null,0]
[null,{"$f":"IF(Alumnos!B389<>\"\",Alumnos!B389,\"\")","v":""},{"$f":"IF(Tareas!$W$1,Alumnos!C389*(30/Tareas!$W$1),\"\")","v":0},{"$f":"Alumnos!D389","v":0},{"$f":"IF(Tareas!$Y$1,Alumnos!E389*(30/Tareas!$Y$1),\"\")","v":0},{"$f":"Alumnos!F389","v":0},{"$f":"Alumnos!G389","v":0},{"$f":"Alumnos!H389","v":0},null,0,0,null,0]
[null,{"$f":"IF(Alumnos!B390<>\"\",Alumnos!B390,\"\")","v":""},{"$f":"IF(Tareas!$W$1,Alumnos!C390*(30/Tareas!$W$1),\"\")","v":0},{"$f":"Alumnos!D390","v":0},{"$f":"IF(Tareas!$Y$1,Alumnos!E390*(30/Tareas!$Y$1),\"\")","v":0},{"$f":"Alumnos!F390","v":0},{"$f":"Alumnos!G390","v":0},{"$f":"Alumnos!H390","v":0},null,0,0,null,0]
[null,{"$f":"IF(Alumnos!B391<>\"\",Alumnos!B391,\"\")","v":""},{"$f":"IF(Tareas!$W$1,Alumnos!C391*(30/Tareas!$W$1),\"\")","v":0},{"$f":"Alumnos!D391","v":0},{"$f":"IF(Tareas!$Y$1,Alumnos!E391*(30/Tareas!$Y$1),\"\")","v":0},{"$f":"Alumnos!F391","v":0},{"$f":"Alumnos!G391","v":0},{"$f":"Alumnos!H391","v":0},null,0,0,null,0]
[null,{"$f":"IF(Alumnos!B392<>\"\",Alumnos!B392,\"\")","v":""},{"$f":"IF(Tareas!$W$1,Alumnos!C392*(30/Tareas!$W$1),\"\")","v":0},{"$f":"Alumnos!D392","v":0},{"$f":"IF(Tareas!$Y$1,Alumnos!E392*(30/Tareas!$Y$1),\"\")","v":0},{"$f":"Alumnos!F392","v":0},{"$f":"Alumnos!G392","v":0},{"$f":"Alumnos!H392","v":0},null,0,0,null,0]
[null,{"$f":"IF(Alumnos!B393<>\"\",Alumnos!B393,\"\")","v":""},{"$f":"IF(Tareas!$W$1,Alumnos!C393*(30/Tareas!$W$1),\"\")","v":0},{"$f":"Alumnos!D393","v":0},{"$f":"IF(Tareas!$Y$1,Alumnos!E393*(30/Tareas!$Y$1),\"\")","v":0},{"$f":"Alumnos!F393","v":0},{"$f":"Alumnos!G393","v":0},{"$f":"Alumnos!H393","v":0},null,0,0,null,0]
[null,{"$f":"IF(Alumnos!B394<>\"\",Alumnos!B394,\"\")","v":""},{"$f":"IF(Tareas!$W$1,Alumnos!C394*(30/Tareas!$W$1),\"\")","v":0},{"$f":"Alumnos!D394","v":0},{"$f":"IF(Tareas!$Y$1,Alumnos!E394*(30/Tareas!$Y$1),\"\")","v":0},{"$f":"Alumnos!F394","v":0},{"$f":"Alumnos!G394","v":0},{"$f":"Alumnos!H394","v":0},null,0,0,null,0]
[null,{"$f":"IF(Alumnos!B395<>\"\",Alumnos!B395,\"\")","v":""},{"$f":"IF(Tareas!$W$1,Alumnos!C395*(30/Tareas!$W$1),\"\")","v":0},{"$f":"Alumnos!D395","v":0},{"$f":"IF(Tareas!$Y$1,Alumnos!E395*(30/Tareas!$Y$1),\"\")","v":0},{"$f":"Alumnos!F395","v":0},{"$f":"Alumnos!G395","v":0},{"$f":"Alumnos!H395","v":0},null,0,0,null,0]
[null,{"$f":"IF(Alumnos!B396<>\"\",Alumnos!B396,\"\")","v":""},{"$f":"IF(Tareas!$W$1,Alumnos!C396*(30/Tareas!$W$1),\"\")","v":0},{"$f":"Alumnos!D396","v":0},{"$f":"IF(Tareas!$Y$1,Alumnos!E396*(30/Tareas!$Y$1),\"\")","v":0},{"$f":"Alumnos!F396","v":0},{"$f":"Alumnos!G396","v":0},{"$f":"Alumnos!H396","v":0},null,0,0,null,0]
[null,{"$f":"IF(Alumnos!B397<>\"\",Alumnos!B397,\"\")","v":""},{"$f":"IF(Tareas!$W$1,Alumnos!C397*(30/Tareas!$W$1),\"\")","v":0},{"$f":"Alumnos!D397","v":0},{"$f":"IF(Tareas!$Y$1,Alumnos!E397*(30/Tareas!$Y$1),\"\")","v":0},{"$f":"Alumnos!F397","v":0},{"$f":"Alumnos!G397","v":0},{"$f":"Alumnos!H397","v":0},null,0,0,null,0]
[null,{"$f":"IF(Alumnos!B398<>\"\",Alumnos!B398,\"\")","v":""},{"$f":"IF(Tareas!$W$1,Alumnos!C398*(30/Tareas!$W$1),\"\")","v":0},{"$f":"Alumnos!D398","v":0},{"$f":"IF(Tareas!$Y$1,Alumnos!E398*(30/Tareas!$Y$1),\"\")","v":0},{"$f":"Alumnos!F398","v":0},{"$f":"Alumnos!G398","v":0},{"$f":"Alumnos!H398","v":0},null,0,0,null,0]
[null,{"$f":"IF(Alumnos!B399<>\"\",Alumnos!B399,\"\")","v":""},{"$f":"IF(Tareas!$W$1,Alumnos!C399*(30/Tareas!$W$1),\"\")","v":0},{"$f":"Alumnos!D399","v":0},{"$f":"IF(Tareas!$Y$1,Alumnos!E399*(30/Tareas!$Y$1),\"\")","v":0},{"$f":"Alumnos!F399","v":0},{"$f":"Alumnos!G399","v":0},{"$f":"Alumnos!H399","v":0},null,0,0,null,0]
[null,{"$f":"IF(Alumnos!B400<>\"\",Alumnos!B400,\"\")","v":""},{"$f":"IF(Tareas!$W$1,Alumnos!C400*(30/Tareas!$W$1),\"\")","v":0},{"$f":"Alumnos!D400","v":0},{"$f":"IF(Tareas!$Y$1,Alumnos!E400*(30/Tareas!$Y$1),\"\")","v":0},{"$f":"Alumnos!F400","v":0},{"$f":"Alumnos!G400","v":0},{"$f":"Alumnos!H400","v":0},null,0,0,null,0]
[null,{"$f":"IF(Alumnos!B401<>\"\",Alumnos!B401,\"\")","v":""},{"$f":"IF(Tareas!$W$1,Alumnos!C401*(30/Tareas!$W$1),\"\")","v":0},{"$f":"Alumnos!D401","v":0},{"$f":"IF(Tareas!$Y$1,Alumnos!E401*(30/Tareas!$Y$1),\"\")","v":0},{"$f":"Alumnos!F401","v":0},{"$f":"Alumnos!G401","v":0},{"$f":"Alumnos!H401","v":0},null,0,0,null,0]
[null,{"$f":"IF(Alumnos!B402<>\"\",Alumnos!B402,\"\")","v":""},{"$f":"IF(Tareas!$W$1,Alumnos!C402*(30/Tareas!$W$1),\"\")","v":0},{"$f":"Alumnos!D402","v":0},{"$f":"IF(Tareas!$Y$1,Alumnos!E402*(30/Tareas!$Y$1),\"\")","v":0},{"$f":"Alumnos!F402","v":0},{"$f":"Alumnos!G402","v":0},{"$f":"Alumnos!H402","v":0},null,0,0,null,0]
[null,{"$f":"IF(Alumnos!B403<>\"\",Alumnos!B403,\"\")","v":""},{"$f":"IF(Tareas!$W$1,Alumnos!C403*(30/Tareas!$W$1),\"\")","v":0},{"$f":"Alumnos!D403","v":0},{"$f":"IF(Tareas!$Y$1,Alumnos!E403*(30/Tareas!$Y$1),\"\")","v":0},{"$f":"Alumnos!F403","v":0},{"$f":"Alumnos!G403","v":0},{"$f":"Alumnos!H403","v":0},null,0,0,null,0]
[null,{"$f":"IF(Alumnos!B404<>\"\",Alumnos!B404,\"\")","v":""},{"$f":"IF(Tareas!$W$1,Alumnos!C404*(30/Tareas!$W$1),\"\")","v":0},{"$f":"Alumnos!D404","v":0},{"$f":"IF(Tareas!$Y$1,Alumnos!E404*(30/Tareas!$Y$1),\"\")","v":0},{"$f":"Alumnos!F404","v":0},{"$f":"Alumnos!G404","v":0},{"$f":"Alumnos!H404","v":0},null,0,0,null,0]
[null,{"$f":"IF(Alumnos!B405<>\"\",Alumnos!B405,\"\")","v":""},{"$f":"IF(Tareas!$W$1,Alumnos!C405*(30/Tareas!$W$1),\"\")","v":0},{"$f":"Alumnos!D405","v":0},{"$f":"IF(Tareas!$Y$1,Alumnos!E405*(30/Tareas!$Y$1),\"\")","v":0},{"$f":"Alumnos!F405","v":0},{"$f":"Alumnos!G405","v":0},{"$f":"Alumnos!H405","v":0},null,0,0,null,0]
[null,{"$f":"IF(Alumnos!B406<>\"\",Alumnos!B406,\"\")","v":""},{"$f":"IF(Tareas!$W$1,Alumnos!C406*(30/Tareas!$W$1),\"\")","v":0},{"$f":"Alumnos!D406","v":0},{"$f":"IF(Tareas!$Y$1,Alumnos!E406*(30/Tareas!$Y$1),\"\")","v":0},{"$f":"Alumnos!F406","v":0},{"$f":"Alumnos!G406","v":0},{"$f":"Alumnos!H406","v":0},null,0,0,null,0]
[null,{"$f":"IF(Alumnos!B407<>\"\",Alumnos!B407,\"\")","v":""},{"$f":"IF(Tareas!$W$1,Alumnos!C407*(30/Tareas!$W$1),\"\")","v":0},{"$f":"Alumnos!D407","v":0},{"$f":"IF(Tareas!$Y$1,Alumnos!E407*(30/Tareas!$Y$1),\"\")","v":0},{"$f":"Alumnos!F407","v":0},{"$f":"Alumnos!G407","v":0},{"$f":"Alumnos!H407","v":0},null,0,0,null,0]
[null,{"$f":"IF(Alumnos!B408<>\"\",Alumnos!B408,\"\")","v":""},{"$f":"IF(Tareas!$W$1,Alumnos!C408*(30/Tareas!$W$1),\"\")","v":0},{"$f":"Alumnos!D408","v":0},{"$f":"IF(Tareas!$Y$1,Alumnos!E408*(30/Tareas!$Y$1),\"\")","v":0},{"$f":"Alumnos!F408","v":0},{"$f":"Alumnos!G408","v":0},{"$f":"Alumnos!H408","v":0},null,0,0,null,0]
[null,{"$f":"IF(Alumnos!B409<>\"\",Alumnos!B409,\"\")","v":""},{"$f":"IF(Tareas!$W$1,Alumnos!C409*(30/Tareas!$W$1),\"\")","v":0},{"$f":"Alumnos!D409","v":0},{"$f":"IF(Tareas!$Y$1,Alumnos!E409*(30/Tareas!$Y$1),\"\")","v":0},{"$f":"Alumnos!F409","v":0},{"$f":"Alumnos!G409","v":0},{"$f":"Alumnos!H409","v":0},null,0,0,null,0]
[null,{"$f":"IF(Alumnos!B410<>\"\",Alumnos!B410,\"\")","v":""},{"$f":"IF(Tareas!$W$1,Alumnos!C410*(30/Tareas!$W$1),\"\")","v":0},{"$f":"Alumnos!D410","v":0},{"$f":"IF(Tareas!$Y$1,Alumnos!E410*(30/Tareas!$Y$1),\"\")","v":0},{"$f":"Alumnos!F410","v":0},{"$f":"Alumnos!G410","v":0},{"$f":"Alumnos!H410","v":0},null,0,0,null,0]
[null,{"$f":"IF(Alumnos!B411<>\"\",Alumnos!B411,\"\")","v":""},{"$f":"IF(Tareas!$W$1,Alumnos!C411*(30/Tareas!$W$1),\"\")","v":0},{"$f":"Alumnos!D411","v":0},{"$f":"IF(Tareas!$Y$1,Alumnos!E411*(30/Tareas!$Y$1),\"\")","v":0},{"$f":"Alumnos!F411","v":0},{"$f":"Alumnos!G411","v":0},{"$f":"Alumnos!H411","v":0},null,0,0,null,0]
[null,{"$f":"IF(Alumnos!B412<>\"\",Alumnos!B412,\"\")","v":""},{"$f":"IF(Tareas!$W$1,Alumnos!C412*(30/Tareas!$W$1),\"\")","v":0},{"$f":"Alumnos!D412","v":0},{"$f":"IF(Tareas!$Y$1,Alumnos!E412*(30/Tareas!$Y$1),\"\")","v":0},{"$f":"Alumnos!F412","v":0},{"$f":"Alumnos!G412","v":0},{"$f":"Alumnos!H412","v":0},null,0,0,null,0]
[null,{"$f":"IF(Alumnos!B413<>\"\",Alumnos!B413,\"\")","v":""},{"$f":"IF(Tareas!$W$1,Alumnos!C413*(30/Tareas!$W$1),\"\")","v":0},{"$f":"Alumnos!D413","v":0},{"$f":"IF(Tareas!$Y$1,Alumnos!E413*(30/Tareas!$Y$1),\"\")","v":0},{"$f":"Alumnos!F413","v":0},{"$f":"Alumnos!G413","v":0},{"$f":"Alumnos!H413","v":0},null,0,0,null,0]
[null,{"$f":"IF(Alumnos!B414<>\"\",Alumnos!B414,\"\")","v":""},{"$f":"IF(Tareas!$W$1,Alumnos!C414*(30/Tareas!$W$1),\"\")","v":0},{"$f":"Alumnos!D414","v":0},{"$f":"IF(Tareas!$Y$1,Alumnos!E414*(30/Tareas!$Y$1),\"\")","v":0},{"$f":"Alumnos!F414","v":0},{"$f":"Alumnos!G414","v":0},{"$f":"Alumnos!H414","v":0},null,0,0,null,0]
[null,{"$f":"IF(Alumnos!B415<>\"\",Alumnos!B415,\"\")","v":""},{"$f":"IF(Tareas!$W$1,Alumnos!C415*(30/Tareas!$W$1),\"\")","v":0},{"$f":"Alumnos!D415","v":0},{"$f":"IF(Tareas!$Y$1,Alumnos!E415*(30/Tareas!$Y$1),\"\")","v":0},{"$f":"Alumnos!F415","v":0},{"$f":"Alumnos!G415","v":0},{"$f":"Alumnos!H415","v":0},null,0,0,null,0]
[null,{"$f":"IF(Alumnos!B416<>\"\",Alumnos!B416,\"\")","v":""},{"$f":"IF(Tareas!$W$1,Alumnos!C416*(30/Tareas!$W$1),\"\")","v":0},{"$f":"Alumnos!D416","v":0},{"$f":"IF(Tareas!$Y$1,Alumnos!E416*(30/Tareas!$Y$1),\"\")","v":0},{"$f":"Alumnos!F416","v":0},{"$f":"Alumnos!G416","v":0},{"$f":"Alumnos!H416","v":0},null,0,0,null,0]
[null,{"$f":"IF(Alumnos!B417<>\"\",Alumnos!B417,\"\")","v":""},{"$f":"IF(Tareas!$W$1,Alumnos!C417*(30/Tareas!$W$1),\"\")","v":0},{"$f":"Alumnos!D417","v":0},{"$f":"IF(Tareas!$Y$1,Alumnos!E417*(30/Tareas!$Y$1),\"\")","v":0},{"$f":"Alumnos!F417","v":0},{"$f":"Alumnos!G417","v":0},{"$f":"Alumnos!H417","v":0},null,0,0,null,0]
[null,{"$f":"IF(Alumnos!B418<>\"\",Alumnos!B418,\"\")","v":""},{"$f":"IF(Tareas!$W$1,Alumnos!C418*(30/Tareas!$W$1),\"\")","v":0},{"$f":"Alumnos!D418","v":0},{"$f":"IF(Tareas!$Y$1,Alumnos!E418*(30/Tareas!$Y$1),\"\")","v":0},{"$f":"Alumnos!F418","v":0},{"$f":"Alumnos!G418","v":0},{"$f":"Alumnos!H418","v":0},null,0,0,null,0]
[null,{"$f":"IF(Alumnos!B419<>\"\",Alumnos!B419,\"\")","v":""},{"$f":"IF(Tareas!$W$1,Alumnos!C419*(30/Tareas!$W$1),\"\")","v":0},{"$f":"Alumnos!D419","v":0},{"$f":"IF(Tareas!$Y$1,Alumnos!E419*(30/Tareas!$Y$1),\"\")","v":0},{"$f":"Alumnos!F419","v":0},{"$f":"Alumnos!G419","v":0},{"$f":"Alumnos!H419","v":0},null,0,0,null,0]
[null,{"$f":"IF(Alumnos!B420<>\"\",Alumnos!B420,\"\")","v":""},{"$f":"IF(Tareas!$W$1,Alumnos!C420*(30/Tareas!$W$1),\"\")","v":0},{"$f":"Alumnos!D420","v":0},{"$f":"IF(Tareas!$Y$1,Alumnos!E420*(30/Tareas!$Y$1),\"\")","v":0},{"$f":"Alumnos!F420","v":0},{"$f":"Alumnos!G420","v":0},{"$f":"Alumnos!H420","v":0},null,0,0,null,0]
[null,{"$f":"IF(Alumnos!B421<>\"\",Alumnos!B421,\"\")","v":""},{"$f":"IF(Tareas!$W$1,Alumnos!C421*(30/Tareas!$W$1),\"\")","v":0},{"$f":"Alumnos!D421","v":0},{"$f":"IF(Tareas!$Y$1,Alumnos!E421*(30/Tareas!$Y$1),\"\")","v":0},{"$f":"Alumnos!F421","v":0},{"$f":"Alumnos!G421","v":0},{"$f":"Alumnos!H421","v":0},null,0,0,null,0]
[null,{"$f":"IF(Alumnos!B422<>\"\",Alumnos!B422,\"\")","v":""},{"$f":"IF(Tareas!$W$1,Alumnos!C422*(30/Tareas!$W$1),\"\")","v":0},{"$f":"Alumnos!D422","v":0},{"$f":"IF(Tareas!$Y$1,Alumnos!E422*(30/Tareas!$Y$1),\"\")","v":0},{"$f":"Alumnos!F422","v":0},{"$f":"Alumnos!G422","v":0},{"$f":"Alumnos!H422","v":0},null,0,0,null,0]
[null,{"$f":"IF(Alumnos!B423<>\"\",Alumnos!B423,\"\")","v":""},{"$f":"IF(Tareas!$W$1,Alumnos!C423*(30/Tareas!$W$1),\"\")","v":0},{"$f":"Alumnos!D423","v":0},{"$f":"IF(Tareas!$Y$1,Alumnos!E423*(30/Tareas!$Y$1),\"\")","v":0},{"$f":"Alumnos!F423","v":0},{"$f":"Alumnos!G423","v":0},{"$f":"Alumnos!H423","v":0},null,0,0,null,0]
[null,{"$f":"IF(Alumnos!B424<>\"\",Alumnos!B424,\"\")","v":""},{"$f":"IF(Tareas!$W$1,Alumnos!C424*(30/Tareas!$W$1),\"\")","v":0},{"$f":"Alumnos!D424","v":0},{"$f":"IF(Tareas!$Y$1,Alumnos!E424*(30/Tareas!$Y$1),\"\")","v":0},{"$f":"Alumnos!F424","v":0},{"$f":"Alumnos!G424","v":0},{"$f":"Alumnos!H424","v":0},null,0,0,null,0]
[null,{"$f":"IF(Alumnos!B425<>\"\",Alumnos!B425,\"\")","v":""},{"$f":"IF(Tareas!$W$1,Alumnos!C425*(30/Tareas!$W$1),\"\")","v":0},{"$f":"Alumnos!D425","v":0},{"$f":"IF(Tareas!$Y$1,Alumnos!E425*(30/Tareas!$Y$1),\"\")","v":0},{"$f":"Alumnos!F425","v":0},{"$f":"Alumnos!G425","v":0},{"$f":"Alumnos!H425","v":0},null,0,0,null,0]
[null,{"$f":"IF(Alumnos!B426<>\"\",Alumnos!B426,\"\")","v":""},{"$f":"IF(Tareas!$W$1,Alumnos!C426*(30/Tareas!$W$1),\"\")","v":0},{"$f":"Alumnos!D426","v":0},{"$f":"IF(Tareas!$Y$1,Alumnos!E426*(30/Tareas!$Y$1),\"\")","v":0},{"$f":"Alumnos!F426","v":0},{"$f":"Alumnos!G426","v":0},{"$f":"Alumnos!H426","v":0},null,0,0,null,0]
[null,{"$f":"IF(Alumnos!B427<>\"\",Alumnos!B427,\"\")","v":""},{"$f":"IF(Tareas!$W$1,Alumnos!C427*(30/Tareas!$W$1),\"\")","v":0},{"$f":"Alumnos!D427","v":0},{"$f":"IF(Tareas!$Y$1,Alumnos!E427*(30/Tareas!$Y$1),\"\")","v":0},{"$f":"Alumnos!F427","v":0},{"$f":"Alumnos!G427","v":0},{"$f":"Alumnos!H427","v":0},null,0,0,null,0]
[null,{"$f":"IF(Alumnos!B428<>\"\",Alumnos!B428,\"\")","v":""},{"$f":"IF(Tareas!$W$1,Alumnos!C428*(30/Tareas!$W$1),\"\")","v":0},{"$f":"Alumnos!D428","v":0},{"$f":"IF(Tareas!$Y$1,Alumnos!E428*(30/Tareas!$Y$1),\"\")","v":0},{"$f":"Alumnos!F428","v":0},{"$f":"Alumnos!G428","v":0},{"$f":"Alumnos!H428","v":0},null,0,0,null,0]
[null,{"$f":"IF(Alumnos!B429<>\"\",Alumnos!B429,\"\")","v":""},{"$f":"IF(Tareas!$W$1,Alumnos!C429*(30/Tareas!$W$1),\"\")","v":0},{"$f":"Alumnos!D429","v":0},{"$f":"IF(Tareas!$Y$1,Alumnos!E429*(30/Tareas!$Y$1),\"\")","v":0},{"$f":"Alumnos!F429","v":0},{"$f":"Alumnos!G429","v":0},{"$f":"Alumnos!H429","v":0},null,0,0,null,0]
[null,{"$f":"IF(Alumnos!B430<>\"\",Alumnos!B430,\"\")","v":""},{"$f":"IF(Tareas!$W$1,Alumnos!C430*(30/Tareas!$W$1),\"\")","v":0},{"$f":"Alumnos!D430","v":0},{"$f":"IF(Tareas!$Y$1,Alumnos!E430*(30/Tareas!$Y$1),\"\")","v":0},{"$f":"Alumnos!F430","v":0},{"$f":"Alumnos!G430","v":0},{"$f":"Alumnos!H430","v":0},null,0,0,null,0]
[null,{"$f":"IF(Alumnos!B431<>\"\",Alumnos!B431,\"\")","v":""},{"$f":"IF(Tareas!$W$1,Alumnos!C431*(30/Tareas!$W$1),\"\")","v":0},{"$f":"Alumnos!D431","v":0},{"$f":"IF(Tareas!$Y$1,Alumnos!E431*(30/Tareas!$Y$1),\"\")","v":0},{"$f":"Alumnos!F431","v":0},{"$f":"Alumnos!G431","v":0},{"$f":"Alumnos!H431","v":0},null,0,0,null,0]
[null,{"$f":"IF(Alumnos!B432<>\"\",Alumnos!B432,\"\")","v":""},{"$f":"IF(Tareas!$W$1,Alumnos!C432*(30/Tareas!$W$1),\"\")","v":0},{"$f":"Alumnos!D432","v":0},{"$f":"IF(Tareas!$Y$1,Alumnos!E432*(30/Tareas!$Y$1),\"\")","v":0},{"$f":"Alumnos!F432","v":0},{"$f":"Alumnos!G432","v":0},{"$f":"Alumnos!H432","v":0},null,0,0,null,0]
[null,{"$f":"IF(Alumnos!B433<>\"\",Alumnos!B433,\"\")","v":""},{"$f":"IF(Tareas!$W$1,Alumnos!C433*(30/Tareas!$W$1),\"\")","v":0},{"$f":"Alumnos!D433","v":0},{"$f":"IF(Tareas!$Y$1,Alumnos!E433*(30/Tareas!$Y$1),\"\")","v":0},{"$f":"Alumnos!F433","v":0},{"$f":"Alumnos!G433","v":0},{"$f":"Alumnos!H433","v":0},null,0,0,null,0]
[null,{"$f":"IF(Alumnos!B434<>\"\",Alumnos!B434,\"\")","v":""},{"$f":"IF(Tareas!$W$1,Alumnos!C434*(30/Tareas!$W$1),\"\")","v":0},{"$f":"Alumnos!D434","v":0},{"$f":"IF(Tareas!$Y$1,Alumnos!E434*(30/Tareas!$Y$1),\"\")","v":0},{"$f":"Alumnos!F434","v":0},{"$f":"Alumnos!G434","v":0},{"$f":"Alumnos!H434","v":0},null,0,0,null,0]
[null,{"$f":"IF(Alumnos!B435<>\"\",Alumnos!B435,\"\")","v":""},{"$f":"IF(Tareas!$W$1,Alumnos!C435*(30/Tareas!$W$1),\"\")","v":0},{"$f":"Alumnos!D435","v":0},{"$f":"IF(Tareas!$Y$1,Alumnos!E435*(30/Tareas!$Y$1),\"\")","v":0},{"$f":"Alumnos!F435","v":0},{"$f":"Alumnos!G435","v":0},{"$f":"Alumnos!H435","v":0},null,0,0,null,0]
[null,{"$f":"IF(Alumnos!B436<>\"\",Alumnos!B436,\"\")","v":""},{"$f":"IF(Tareas!$W$1,Alumnos!C436*(30/Tareas!$W$1),\"\")","v":0},{"$f":"Alumnos!D436","v":0},{"$f":"IF(Tareas!$Y$1,Alumnos!E436*(30/Tareas!$Y$1),\"\")","v":0},{"$f":"Alumnos!F436","v":0},{"$f":"Alumnos!G436","v":0},{"$f":"Alumnos!H436","v":0},null,0,0,null,0]
[null,{"$f":"IF(Alumnos!B437<>\"\",Alumnos!B437,\"\")","v":""},{"$f":"IF(Tareas!$W$1,Alumnos!C437*(30/Tareas!$W$1),\"\")","v":0},{"$f":"Alumnos!D437","v":0},{"$f":"IF(Tareas!$Y$1,Alumnos!E437*(30/Tareas!$Y$1),\"\")","v":0},{"$f":"Alumnos!F437","v":0},{"$f":"Alumnos!G437","v":0},{"$f":"Alumnos!H437","v":0},null,0,0,null,0]
[null,{"$f":"IF(Alumnos!B438<>\"\",Alumnos!B438,\"\")","v":""},{"$f":"IF(Tareas!$W$1,Alumnos!C438*(30/Tareas!$W$1),\"\")","v":0},{"$f":"Alumnos!D438","v":0},{"$f":"IF(Tareas!$Y$1,Alumnos!E438*(30/Tareas!$Y$1),\"\")","v":0},{"$f":"Alumnos!F438","v":0},{"$f":"Alumnos!G438","v":0},{"$f":"Alumnos!H438","v":0},null,0,0,null,0]
[null,{"$f":"IF(Alumnos!B439<>\"\",Alumnos!B439,\"\")","v":""},{"$f":"IF(Tareas!$W$1,Alumnos!C439*(30/Tareas!$W$1),\"\")","v":0},{"$f":"Alumnos!D439","v":0},{"$f":"IF(Tareas!$Y$1,Alumnos!E439*(30/Tareas!$Y$1),\"\")","v":0},{"$f":"Alumnos!F439","v":0},{"$f":"Alumnos!G439","v":0},{"$f":"Alumnos!H439","v":0},null,0,0,null,0]
[null,{"$f":"IF(Alumnos!B440<>\"\",Alumnos!B440,\"\")","v":""},{"$f":"IF(Tareas!$W$1,Alumnos!C440*(30/Tareas!$W$1),\"\")","v":0},{"$f":"Alumnos!D440","v":0},{"$f":"IF(Tareas!$Y$1,Alumnos!E440*(30/Tareas!$Y$1),\"\")","v":0},{"$f":"Alumnos!F440","v":0},{"$f":"Alumnos!G440","v":0},{"$f":"Alumnos!H440","v":0},null,0,0,null,0]
[null,{"$f":"IF(Alumnos!B441<>\"\",Alumnos!B441,\"\")","v":""},{"$f":"IF(Tareas!$W$1,Alumnos!C441*(30/Tareas!$W$1),\"\")","v":0},{"$f":"Alumnos!D441","v":0},{"$f":"IF(Tareas!$Y$1,Alumnos!E441*(30/Tareas!$Y$1),\"\")","v":0},{"$f":"Alumnos!F441","v":0},{"$f":"Alumnos!G441","v":0},{"$f":"Alumnos!H441","v":0},null,0,0,null,0]
[null,{"$f":"IF(Alumnos!B442<>\"\",Alumnos!B442,\"\")","v":""},{"$f":"IF(Tareas!$W$1,Alumnos!C442*(30/Tareas!$W$1),\"\")","v":0},{"$f":"Alumnos!D442","v":0},{"$f":"IF(Tareas!$Y$1,Alumnos!E442*(30/Tareas!$Y$1),\"\")","v":0},{"$f":"Alumnos!F442","v":0},{"$f":"Alumnos!G442","v":0},{"$f":"Alumnos!H442","v":0},null,0,0,null,0]
[null,{"$f":"IF(Alumnos!B443<>\"\",Alumnos!B443,\"\")","v":""},{"$f":"IF(Tareas!$W$1,Alumnos!C443*(30/Tareas!$W$1),\"\")","v":0},{"$f":"Alumnos!D443","v":0},{"$f":"IF(Tareas!$Y$1,Alumnos!E443*(30/Tareas!$Y$1),\"\")","v":0},{"$f":"Alumnos!F443","v":0},{"$f":"Alumnos!G443","v":0},{"$f":"Alumnos!H443","v":0},null,0,0,null,0]
[null,{"$f":"IF(Alumnos!B444<>\"\",Alumnos!B444,\"\")","v":""},{"$f":"IF(Tareas!$W$1,Alumnos!C444*(30/Tareas!$W$1),\"\")","v":0},{"$f":"Alumnos!D444","v":0},{"$f":"IF(Tareas!$Y$1,Alumnos!E444*(30/Tareas!$Y$1),\"\")","v":0},{"$f":"Alumnos!F444","v":0},{"$f":"Alumnos!G444","v":0},{"$f":"Alumnos!H444","v":0},null,0,0,null,0]
[null,{"$f":"IF(Alumnos!B445<>\"\",Alumnos!B445,\"\")","v":""},{"$f":"IF(Tareas!$W$1,Alumnos!C445*(30/Tareas!$W$1),\"\")","v":0},{"$f":"Alumnos!D445","v":0},{"$f":"IF(Tareas!$Y$1,Alumnos!E445*(30/Tareas!$Y$1),\"\")","v":0},{"$f":"Alumnos!F445","v":0},{"$f":"Alumnos!G445","v":0},{"$f":"Alumnos!H445","v":0},null,0,0,null,0]
[null,{"$f":"IF(Alumnos!B446<>\"\",Alumnos!B446,\"\")","v":""},{"$f":"IF(Tareas!$W$1,Alumnos!C446*(30/Tareas!$W$1),\"\")","v":0},{"$f":"Alumnos!D446","v":0},{"$f":"IF(Tareas!$Y$1,Alumnos!E446*(30/Tareas!$Y$1),\"\")","v":0},{"$f":"Alumnos!F446","v":0},{"$f":"Alumnos!G446","v":0},{"$f":"Alumnos!H446","v":0},null,0,0,null,0]
[null,{"$f":"IF(Alumnos!B447<>\"\",Alumnos!B447,\"\")","v":""},{"$f":"IF(Tareas!$W$1,Alumnos!C447*(30/Tareas!$W$1),\"\")","v":0},{"$f":"Alumnos!D447","v":0},{"$f":"IF(Tareas!$Y$1,Alumnos!E447*(30/Tareas!$Y$1),\"\")","v":0},{"$f":"Alumnos!F447","v":0},{"$f":"Alumnos!G447","v":0},{"$f":"Alumnos!H447","v":0},null,0,0,null,0]
[null,{"$f":"IF(Alumnos!B448<>\"\",Alumnos!B448,\"\")","v":""},{"$f":"IF(Tareas!$W$1,Alumnos!C448*(30/Tareas!$W$1),\"\")","v":0},{"$f":"Alumnos!D448","v":0},{"$f":"IF(Tareas!$Y$1,Alumnos!E448*(30/Tareas!$Y$1),\"\")","v":0},{"$f":"Alumnos!F448","v":0},{"$f":"Alumnos!G448","v":0},{"$f":"Alumnos!H448","v":0},null,0,0,null,0]
[null,{"$f":"IF(Alumnos!B449<>\"\",Alumnos!B449,\"\")","v":""},{"$f":"IF(Tareas!$W$1,Alumnos!C449*(30/Tareas!$W$1),\"\")","v":0},{"$f":"Alumnos!D449","v":0},{"$f":"IF(Tareas!$Y$1,Alumnos!E449*(30/Tareas!$Y$1),\"\")","v":0},{"$f":"Alumnos!F449","v":0},{"$f":"Alumnos!G449","v":0},{"$f":"Alumnos!H449","v":0},null,0,0,null,0]
[null,{"$f":"IF(Alumnos!B450<>\"\",Alumnos!B450,\"\")","v":""},{"$f":"IF(Tareas!$W$1,Alumnos!C450*(30/Tareas!$W$1),\"\")","v":0},{"$f":"Alumnos!D450","v":0},{"$f":"IF(Tareas!$Y$1,Alumnos!E450*(30/Tareas!$Y$1),\"\")","v":0},{"$f":"Alumnos!F450","v":0},{"$f":"Alumnos!G450","v":0},{"$f":"Alumnos!H450","v":0},null,0,0,null,0]
[null,{"$f":"IF(Alumnos!B451<>\"\",Alumnos!B451,\"\")","v":""},{"$f":"IF(Tareas!$W$1,Alumnos!C451*(30/Tareas!$W$1),\"\")","v":0},{"$f":"Alumnos!D451","v":0},{"$f":"IF(Tareas!$Y$1,Alumnos!E451*(30/Tareas!$Y$1),\"\")","v":0},{"$f":"Alumnos!F451","v":0},{"$f":"Alumnos!G451","v":0},{"$f":"Alumnos!H451","v":0},null,{"$f":"SUM(C451:F451)","v":0},{"$f":"SUM(G451:H451)","v":0},null,{"$f":"(J451+K451)/2","v":0}]
[null,{"$f":"IF(Alumnos!B452<>\"\",Alumnos!B452,\"\")","v":""},{"$f":"IF(Tareas!$W$1,Alumnos!C452*(30/Tareas!$W$1),\"\")","v":0},{"$f":"Alumnos!D452","v":0},{"$f":"IF(Tareas!$Y$1,Alumnos!E452*(30/Tareas!$Y$1),\"\")","v":0},{"$f":"Alumnos!F452","v":0},{"$f":"Alumnos!G452","v":0},{"$f":"Alumnos!H452","v":0},null,0,0,null,0]
[null,{"$f":"IF(Alumnos!B453<>\"\",Alumnos!B453,\"\")","v":""},{"$f":"IF(Tareas!$W$1,Alumnos!C453*(30/Tareas!$W$1),\"\")","v":0},{"$f":"Alumnos!D453","v":0},{"$f":"IF(Tareas!$Y$1,Alumnos!E453*(30/Tareas!$Y$1),\"\")","v":0},{"$f":"Alumnos!F453","v":0},{"$f":"Alumnos!G453","v":0},{"$f":"Alumnos!H453","v":0},null,0,0,null,0]
[null,{"$f":"IF(Alumnos!B454<>\"\",Alumnos!B454,\"\")","v":""},{"$f":"IF(Tareas!$W$1,Alumnos!C454*(30/Tareas!$W$1),\"\")","v":0},{"$f":"Alumnos!D454","v":0},{"$f":"IF(Tareas!$Y$1,Alumnos!E454*(30/Tareas!$Y$1),\"\")","v":0},{"$f":"Alumnos!F454","v":0},{"$f":"Alumnos!G454","v":0},{"$f":"Alumnos!H454","v":0},null,0,0,null,0]
[null,{"$f":"IF(Alumnos!B455<>\"\",Alumnos!B455,\"\")","v":""},{"$f":"IF(Tareas!$W$1,Alumnos!C455*(30/Tareas!$W$1),\"\")","v":0},{"$f":"Alumnos!D455","v":0},{"$f":"IF(Tareas!$Y$1,Alumnos!E455*(30/Tareas!$Y$1),\"\")","v":0},{"$f":"Alumnos!F455","v":0},{"$f":"Alumnos!G455","v":0},{"$f":"Alumnos!H455","v":0},null,0,0,null,0]
[null,{"$f":"IF(Alumnos!B456<>\"\",Alumnos!B456,\"\")","v":""},{"$f":"IF(Tareas!$W$1,Alumnos!C456*(30/Tareas!$W$1),\"\")","v":0},{"$f":"Alumnos!D456","v":0},{"$f":"IF(Tareas!$Y$1,Alumnos!E456*(30/Tareas!$Y$1),\"\")","v":0},{"$f":"Alumnos!F456","v":0},{"$f":"Alumnos!G456","v":0},{"$f":"Alumnos!H456","v":0},null,0,0,null,0]
[null,{"$f":"IF(Alumnos!B457<>\"\",Alumnos!B457,\"\")","v":""},{"$f":"IF(Tareas!$W$1,Alumnos!C457*(30/Tareas!$W$1),\"\")","v":0},{"$f":"Alumnos!D457","v":0},{"$f":"IF(Tareas!$Y$1,Alumnos!E457*(30/Tareas!$Y$1),\"\")","v":0},{"$f":"Alumnos!F457","v":0},{"$f":"Alumnos!G457","v":0},{"$f":"Alumnos!H457","v":0},null,0,0,null,0]
[null,{"$f":"IF(Alumnos!B458<>\"\",Alumnos!B458,\"\")","v":""},{"$f":"IF(Tareas!$W$1,Alumnos!C458*(30/Tareas!$W$1),\"\")","v":0},{"$f":"Alumnos!D458","v":0},{"$f":"IF(Tareas!$Y$1,Alumnos!E458*(30/Tareas!$Y$1),\"\")","v":0},{"$f":"Alumnos!F458","v":0},{"$f":"Alumnos!G458","v":0},{"$f":"Alumnos!H458","v":0},null,0,0,null,0]
[null,{"$f":"IF(Alumnos!B459<>\"\",Alumnos!B459,\"\")","v":""},{"$f":"IF(Tareas!$W$1,Alumnos!C459*(30/Tareas!$W$1),\"\")","v":0},{"$f":"Alumnos!D459","v":0},{"$f":"IF(Tareas!$Y$1,Alumnos!E459*(30/Tareas!$Y$1),\"\")","v":0},{"$f":"Alumnos!F459","v":0},{"$f":"Alumnos!G459","v":0},{"$f":"Alumnos!H459","v":0},null,0,0,null,0]
[null,{"$f":"IF(Alumnos!B460<>\"\",Alumnos!B460,\"\")","v":""},{"$f":"IF(Tareas!$W$1,Alumnos!C460*(30/Tareas!$W$1),\"\")","v":0},{"$f":"Alumnos!D460","v":0},{"$f":"IF(Tareas!$Y$1,Alumnos!E460*(30/Tareas!$Y$1),\"\")","v":0},{"$f":"Alumnos!F460","v":0},{"$f":"Alumnos!G460","v":0},{"$f":"Alumnos!H460","v":0},null,0,0,null,0]
[null,{"$f":"IF(Alumnos!B461<>\"\",Alumnos!B461,\"\")","v":""},{"$f":"IF(Tareas!$W$1,Alumnos!C461*(30/Tareas!$W$1),\"\")","v":0},{"$f":"Alumnos!D461","v":0},{"$f":"IF(Tareas!$Y$1,Alumnos!E461*(30/Tareas!$Y$1),\"\")","v":0},{"$f":"Alumnos!F461","v":0},{"$f":"Alumnos!G461","v":0},{"$f":"Alumnos!H461","v":0},null,0,0,null,0]
[null,{"$f":"IF(Alumnos!B462<>\"\",Alumnos!B462,\"\")","v":""},{"$f":"IF(Tareas!$W$1,Alumnos!C462*(30/Tareas!$W$1),\"\")","v":0},{"$f":"Alumnos!D462","v":0},{"$f":"IF(Tareas!$Y$1,Alumnos!E462*(30/Tareas!$Y$1),\"\")","v":0},{"$f":"Alumnos!F462","v":0},{"$f":"Alumnos!G462","v":0},{"$f":"Alumnos!H462","v":0},null,0,0,null,0]
[null,{"$f":"IF(Alumnos!B463<>\"\",Alumnos!B463,\"\")","v":""},{"$f":"IF(Tareas!$W$1,Alumnos!C463*(30/Tareas!$W$1),\"\")","v":0},{"$f":"Alumnos!D463","v":0},{"$f":"IF(Tareas!$Y$1,Alumnos!E463*(30/Tareas!$Y$1),\"\")","v":0},{"$f":"Alumnos!F463","v":0},{"$f":"Alumnos!G463","v":0},{"$f":"Alumnos!H463","v":0},null,0,0,null,0]
[null,{"$f":"IF(Alumnos!B464<>\"\",Alumnos!B464,\"\")","v":""},{"$f":"IF(Tareas!$W$1,Alumnos!C464*(30/Tareas!$W$1),\"\")","v":0},{"$f":"Alumnos!D464","v":0},{"$f":"IF(Tareas!$Y$1,Alumnos!E464*(30/Tareas!$Y$1),\"\")","v":0},{"$f":"Alumnos!F464","v":0},{"$f":"Alumnos!G464","v":0},{"$f":"Alumnos!H464","v":0},null,0,0,null,0]
[null,{"$f":"IF(Alumnos!B465<>\"\",Alumnos!B465,\"\")","v":""},{"$f":"IF(Tareas!$W$1,Alumnos!C465*(30/Tareas!$W$1),\"\")","v":0},{"$f":"Alumnos!D465","v":0},{"$f":"IF(Tareas!$Y$1,Alumnos!E465*(30/Tareas!$Y$1),\"\")","v":0},{"$f":"Alumnos!F465","v":0},{"$f":"Alumnos!G465","v":0},{"$f":"Alumnos!H465","v":0},null,0,0,null,0]
[null,{"$f":"IF(Alumnos!B466<>\"\",Alumnos!B466,\"\")","v":""},{"$f":"IF(Tareas!$W$1,Alumnos!C466*(30/Tareas!$W$1),\"\")","v":0},{"$f":"Alumnos!D466","v":0},{"$f":"IF(Tareas!$Y$1,Alumnos!E466*(30/Tareas!$Y$1),\"\")","v":0},{"$f":"Alumnos!F466","v":0},{"$f":"Alumnos!G466","v":0},{"$f":"Alumnos!H466","v":0},null,0,0,null,0]
[null,{"$f":"IF(Alumnos!B467<>\"\",Alumnos!B467,\"\")","v":""},{"$f":"IF(Tareas!$W$1,Alumnos!C467*(30/Tareas!$W$1),\"\")","v":0},{"$f":"Alumnos!D467","v":0},{"$f":"IF(Tareas!$Y$1,Alumnos!E467*(30/Tareas!$Y$1),\"\")","v":0},{"$f":"Alumnos!F467","v":0},{"$f":"Alumnos!G467","v":0},{"$f":"Alumnos!H467","v":0},null,0,0,null,0]
[null,{"$f":"IF(Alumnos!B468<>\"\",Alumnos!B468,\"\")","v":""},{"$f":"IF(Tareas!$W$1,Alumnos!C468*(30/Tareas!$W$1),\"\")","v":0},{"$f":"Alumnos!D468","v":0},{"$f":"IF(Tareas!$Y$1,Alumnos!E468*(30/Tareas!$Y$1),\"\")","v":0},{"$f":"Alumnos!F468","v":0},{"$f":"Alumnos!G468","v":0},{"$f":"Alumnos!H468","v":0},null,0,0,null,0]
[null,{"$f":"IF(Alumnos!B469<>\"\",Alumnos!B469,\"\")","v":""},{"$f":"IF(Tareas!$W$1,Alumnos!C469*(30/Tareas!$W$1),\"\")","v":0},{"$f":"Alumnos!D469","v":0},{"$f":"IF(Tareas!$Y$1,Alumnos!E469*(30/Tareas!$Y$1),\"\")","v":0},{"$f":"Alumnos!F469","v":0},{"$f":"Alumnos!G469","v":0},{"$f":"Alumnos!H469","v":0},null,0,0,null,0]
[null,{"$f":"IF(Alumnos!B470<>\"\",Alumnos!B470,\"\")","v":""},{"$f":"IF(Tareas!$W$1,Alumnos!C470*(30/Tareas!$W$1),\"\")","v":0},{"$f":"Alumnos!D470","v":0},{"$f":"IF(Tareas!$Y$1,Alumnos!E470*(30/Tareas!$Y$1),\"\")","v":0},{"$f":"Alumnos!F470","v":0},{"$f":"Alumnos!G470","v":0},{"$f":"Alumnos!H470","v":0},null,0,0,null,0]
[null,{"$f":"IF(Alumnos!B471<>\"\",Alumnos!B471,\"\")","v":""},{"$f":"IF(Tareas!$W$1,Alumnos!C471*(30/Tareas!$W$1),\"\")","v":0},{"$f":"Alumnos!D471","v":0},{"$f":"IF(Tareas!$Y$1,Alumnos!E471*(30/Tareas!$Y$1),\"\")","v":0},{"$f":"Alumnos!F471","v":0},{"$f":"Alumnos!G471","v":0},{"$f":"Alumnos!H471","v":0},null,0,0,null,0]
[null,{"$f":"IF(Alumnos!B472<>\"\",Alumnos!B472,\"\")","v":""},{"$f":"IF(Tareas!$W$1,Alumnos!C472*(30/Tareas!$W$1),\"\")","v":0},{"$f":"Alumnos!D472","v":0},{"$f":"IF(Tareas!$Y$1,Alumnos!E472*(30/Tareas!$Y$1),\"\")","v":0},{"$f":"Alumnos!F472","v":0},{"$f":"Alumnos!G472","v":0},{"$f":"Alumnos!H472","v":0},null,0,0,null,0]
[null,{"$f":"IF(Alumnos!B473<>\"\",Alumnos!B473,\"\")","v":""},{"$f":"IF(Tareas!$W$1,Alumnos!C473*(30/Tareas!$W$1),\"\")","v":0},{"$f":"Alumnos!D473","v":0},{"$f":"IF(Tareas!$Y$1,Alumnos!E473*(30/Tareas!$Y$1),\"\")","v":0},{"$f":"Alumnos!F473","v":0},{"$f":"Alumnos!G473","v":0},{"$f":"Alumnos!H473","v":0},null,0,0,null,0]
[null,{"$f":"IF(Alumnos!B474<>\"\",Alumnos!B474,\"\")","v":""},{"$f":"IF(Tareas!$W$1,Alumnos!C474*(30/Tareas!$W$1),\"\")","v":0},{"$f":"Alumnos!D474","v":0},{"$f":"IF(Tareas!$Y$1,Alumnos!E474*(30/Tareas!$Y$1),\"\")","v":0},{"$f":"Alumnos!F474","v":0},{"$f":"Alumnos!G474","v":0},{"$f":"Alumnos!H474","v":0},null,0,0,null,0]
[null,{"$f":"IF(Alumnos!B475<>\"\",Alumnos!B475,\"\")","v":""},{"$f":"IF(Tareas!$W$1,Alumnos!C475*(30/Tareas!$W$1),\"\")","v":0},{"$f":"Alumnos!D475","v":0},{"$f":"IF(Tareas!$Y$1,Alumnos!E475*(30/Tareas!$Y$1),\"\")","v":0},{"$f":"Alumnos!F475","v":0},{"$f":"Alumnos!G475","v":0},{"$f":"Alumnos!H475","v":0},null,0,0,null,0]
[null,{"$f":"IF(Alumnos!B476<>\"\",Alumnos!B476,\"\")","v":""},{"$f":"IF(Tareas!$W$1,Alumnos!C476*(30/Tareas!$W$1),\"\")","v":0},{"$f":"Alumnos!D476","v":0},{"$f":"IF(Tareas!$Y$1,Alumnos!E476*(30/Tareas!$Y$1),\"\")","v":0},{"$f":"Alumnos!F476","v":0},{"$f":"Alumnos!G476","v":0},{"$f":"Alumnos!H476","v":0},null,0,0,null,0]
[null,{"$f":"IF(Alumnos!B477<>\"\",Alumnos!B477,\"\")","v":""},{"$f":"IF(Tareas!$W$1,Alumnos!C477*(30/Tareas!$W$1),\"\")","v":0},{"$f":"Alumnos!D477","v":0},{"$f":"IF(Tareas!$Y$1,Alumnos!E477*(30/Tareas!$Y$1),\"\")","v":0},{"$f":"Alumnos!F477","v":0},{"$f":"Alumnos!G477","v":0},{"$f":"Alumnos!H477","v":0},null,0,0,null,0]
[null,{"$f":"IF(Alumnos!B478<>\"\",Alumnos!B478,\"\")","v":""},{"$f":"IF(Tareas!$W$1,Alumnos!C478*(30/Tareas!$W$1),\"\")","v":0},{"$f":"Alumnos!D478","v":0},{"$f":"IF(Tareas!$Y$1,Alumnos!E478*(30/Tareas!$Y$1),\"\")","v":0},{"$f":"Alumnos!F478","v":0},{"$f":"Alumnos!G478","v":0},{"$f":"Alumnos!H478","v":0},null,0,0,null,0]
[null,{"$f":"IF(Alumnos!B479<>\"\",Alumnos!B479,\"\")","v":""},{"$f":"IF(Tareas!$W$1,Alumnos!C479*(30/Tareas!$W$1),\"\")","v":0},{"$f":"Alumnos!D479","v":0},{"$f":"IF(Tareas!$Y$1,Alumnos!E479*(30/Tareas!$Y$1),\"\")","v":0},{"$f":"Alumnos!F479","v":0},{"$f":"Alumnos!G479","v":0},{"$f":"Alumnos!H479","v":0},null,0,0,null,0]
[null,{"$f":"IF(Alumnos!B480<>\"\",Alumnos!B480,\"\")","v":""},{"$f":"IF(Tareas!$W$1,Alumnos!C480*(30/Tareas!$W$1),\"\")","v":0},{"$f":"Alumnos!D480","v":0},{"$f":"IF(Tareas!$Y$1,Alumnos!E480*(30/Tareas!$Y$1),\"\")","v":0},{"$f":"Alumnos!F480","v":0},{"$f":"Alumnos!G480","v":0},{"$f":"Alumnos!H480","v":0},null,0,0,null,0]
[null,{"$f":"IF(Alumnos!B481<>\"\",Alumnos!B481,\"\")","v":""},{"$f":"IF(Tareas!$W$1,Alumnos!C481*(30/Tareas!$W$1),\"\")","v":0},{"$f":"Alumnos!D481","v":0},{"$f":"IF(Tareas!$Y$1,Alumnos!E481*(30/Tareas!$Y$1),\"\")","v":0},{"$f":"Alumnos!F481","v":0},{"$f":"Alumnos!G481","v":0},{"$f":"Alumnos!H481","v":0},null,0,0,null,0]
[null,{"$f":"IF(Alumnos!B482<>\"\",Alumnos!B482,\"\")","v":""},{"$f":"IF(Tareas!$W$1,Alumnos!C482*(30/Tareas!$W$1),\"\")","v":0},{"$f":"Alumnos!D482","v":0},{"$f":"IF(Tareas!$Y$1,Alumnos!E482*(30/Tareas!$Y$1),\"\")","v":0},{"$f":"Alumnos!F482","v":0},{"$f":"Alumnos!G482","v":0},{"$f":"Alumnos!H482","v":0},null,0,0,null,0]
[null,{"$f":"IF(Alumnos!B483<>\"\",Alumnos!B483,\"\")","v":""},{"$f":"IF(Tareas!$W$1,Alumnos!C483*(30/Tareas!$W$1),\"\")","v":0},{"$f":"Alumnos!D483","v":0},{"$f":"IF(Tareas!$Y$1,Alumnos!E483*(30/Tareas!$Y$1),\"\")","v":0},{"$f":"Alumnos!F483","v":0},{"$f":"Alumnos!G483","v":0},{"$f":"Alumnos!H483","v":0},null,0,0,null,0]
[null,{"$f":"IF(Alumnos!B484<>\"\",Alumnos!B484,\"\")","v":""},{"$f":"IF(Tareas!$W$1,Alumnos!C484*(30/Tareas!$W$1),\"\")","v":0},{"$f":"Alumnos!D484","v":0},{"$f":"IF(Tareas!$Y$1,Alumnos!E484*(30/Tareas!$Y$1),\"\")","v":0},{"$f":"Alumnos!F484","v":0},{"$f":"Alumnos!G484","v":0},{"$f":"Alumnos!H484","v":0},null,0,0,null,0]
[null,{"$f":"IF(Alumnos!B485<>\"\",Alumnos!B485,\"\")","v":""},{"$f":"IF(Tareas!$W$1,Alumnos!C485*(30/Tareas!$W$1),\"\")","v":0},{"$f":"Alumnos!D485","v":0},{"$f":"IF(Tareas!$Y$1,Alumnos!E485*(30/Tareas!$Y$1),\"\")","v":0},{"$f":"Alumnos!F485","v":0},{"$f":"Alumnos!G485","v":0},{"$f":"Alumnos!H485","v":0},null,0,0,null,0]
[null,{"$f":"IF(Alumnos!B486<>\"\",Alumnos!B486,\"\")","v":""},{"$f":"IF(Tareas!$W$1,Alumnos!C486*(30/Tareas!$W$1),\"\")","v":0},{"$f":"Alumnos!D486","v":0},{"$f":"IF(Tareas!$Y$1,Alumnos!E486*(30/Tareas!$Y$1),\"\")","v":0},{"$f":"Alumnos!F486","v":0},{"$f":"Alumnos!G486","v":0},{"$f":"Alumnos!H486","v":0},null,0,0,null,0]
[null,{"$f":"IF(Alumnos!B487<>\"\",Alumnos!B487,\"\")","v":""},{"$f":"IF(Tareas!$W$1,Alumnos!C487*(30/Tareas!$W$1),\"\")","v":0},{"$f":"Alumnos!D487","v":0},{"$f":"IF(Tareas!$Y$1,Alumnos!E487*(30/Tareas!$Y$1),\"\")","v":0},{"$f":"Alumnos!F487","v":0},{"$f":"Alumnos!G487","v":0},{"$f":"Alumnos!H487","v":0},null,0,0,null,0]
[null,{"$f":"IF(Alumnos!B488<>\"\",Alumnos!B488,\"\")","v":""},{"$f":"IF(Tareas!$W$1,Alumnos!C488*(30/Tareas!$W$1),\"\")","v":0},{"$f":"Alumnos!D488","v":0},{"$f":"IF(Tareas!$Y$1,Alumnos!E488*(30/Tareas!$Y$1),\"\")","v":0},{"$f":"Alumnos!F488","v":0},{"$f":"Alumnos!G488","v":0},{"$f":"Alumnos!H488","v":0},null,0,0,null,0]
[null,{"$f":"IF(Alumnos!B489<>\"\",Alumnos!B489,\"\")","v":""},{"$f":"IF(Tareas!$W$1,Alumnos!C489*(30/Tareas!$W$1),\"\")","v":0},{"$f":"Alumnos!D489","v":0},{"$f":"IF(Tareas!$Y$1,Alumnos!E489*(30/Tareas!$Y$1),\"\")","v":0},{"$f":"Alumnos!F489","v":0},{"$f":"Alumnos!G489","v":0},{"$f":"Alumnos!H489","v":0},null,0,0,null,0]
[null,{"$f":"IF(Alumnos!B490<>\"\",Alumnos!B490,\"\")","v":""},{"$f":"IF(Tareas!$W$1,Alumnos!C490*(30/Tareas!$W$1),\"\")","v":0},{"$f":"Alumnos!D490","v":0},{"$f":"IF(Tareas!$Y$1,Alumnos!E490*(30/Tareas!$Y$1),\"\")","v":0},{"$f":"Alumnos!F490","v":0},{"$f":"Alumnos!G490","v":0},{"$f":"Alumnos!H490","v":0},null,0,0,null,0]
[null,{"$f":"IF(Alumnos!B491<>\"\",Alumnos!B491,\"\")","v":""},{"$f":"IF(Tareas!$W$1,Alumnos!C491*(30/Tareas!$W$1),\"\")","v":0},{"$f":"Alumnos!D491","v":0},{"$f":"IF(Tareas!$Y$1,Alumnos!E491*(30/Tareas!$Y$1),\"\")","v":0},{"$f":"Alumnos!F491","v":0},{"$f":"Alumnos!G491","v":0},{"$f":"Alumnos!H491","v":0},null,0,0,null,0]
[null,{"$f":"IF(Alumnos!B492<>\"\",Alumnos!B492,\"\")","v":""},{"$f":"IF(Tareas!$W$1,Alumnos!C492*(30/Tareas!$W$1),\"\")","v":0},{"$f":"Alumnos!D492","v":0},{"$f":"IF(Tareas!$Y$1,Alumnos!E492*(30/Tareas!$Y$1),\"\")","v":0},{"$f":"Alumnos!F492","v":0},{"$f":"Alumnos!G492","v":0},{"$f":"Alumnos!H492","v":0},null,0,0,null,0]
[null,{"$f":"IF(Alumnos!B493<>\"\",Alumnos!B493,\"\")","v":""},{"$f":"IF(Tareas!$W$1,Alumnos!C493*(30/Tareas!$W$1),\"\")","v":0},{"$f":"Alumnos!D493","v":0},{"$f":"IF(Tareas!$Y$1,Alumnos!E493*(30/Tareas!$Y$1),\"\")","v":0},{"$f":"Alumnos!F493","v":0},{"$f":"Alumnos!G493","v":0},{"$f":"Alumnos!H493","v":0},null,0,0,null,0]
[null,{"$f":"IF(Alumnos!B494<>\"\",Alumnos!B494,\"\")","v":""},{"$f":"IF(Tareas!$W$1,Alumnos!C494*(30/Tareas!$W$1),\"\")","v":0},{"$f":"Alumnos!D494","v":0},{"$f":"IF(Tareas!$Y$1,Alumnos!E494*(30/Tareas!$Y$1),\"\")","v":0},{"$f":"Alumnos!F494","v":0},{"$f":"Alumnos!G494","v":0},{"$f":"Alumnos!H494","v":0},null,0,0,null,0]
[null,{"$f":"IF(Alumnos!B495<>\"\",Alumnos!B495,\"\")","v":""},{"$f":"IF(Tareas!$W$1,Alumnos!C495*(30/Tareas!$W$1),\"\")","v":0},{"$f":"Alumnos!D495","v":0},{"$f":"IF(Tareas!$Y$1,Alumnos!E495*(30/Tareas!$Y$1),\"\")","v":0},{"$f":"Alumnos!F495","v":0},{"$f":"Alumnos!G495","v":0},{"$f":"Alumnos!H495","v":0},null,0,0,null,0]
[null,{"$f":"IF(Alumnos!B496<>\"\",Alumnos!B496,\"\")","v":""},{"$f":"IF(Tareas!$W$1,Alumnos!C496*(30/Tareas!$W$1),\"\")","v":0},{"$f":"Alumnos!D496","v":0},{"$f":"IF(Tareas!$Y$1,Alumnos!E496*(30/Tareas!$Y$1),\"\")","v":0},{"$f":"Alumnos!F496","v":0},{"$f":"Alumnos!G496","v":0},{"$f":"Alumnos!H496","v":0},null,0,0,null,0]
[null,{"$f":"IF(Alumnos!B497<>\"\",Alumnos!B497,\"\")","v":""},{"$f":"IF(Tareas!$W$1,Alumnos!C497*(30/Tareas!$W$1),\"\")","v":0},{"$f":"Alumnos!D497","v":0},{"$f":"IF(Tareas!$Y$1,Alumnos!E497*(30/Tareas!$Y$1),\"\")","v":0},{"$f":"Alumnos!F497","v":0},{"$f":"Alumnos!G497","v":0},{"$f":"Alumnos!H497","v":0},null,0,0,null,0]
[null,{"$f":"IF(Alumnos!B498<>\"\",Alumnos!B498,\"\")","v":""},{"$f":"IF(Tareas!$W$1,Alumnos!C498*(30/Tareas!$W$1),\"\")","v":0},{"$f":"Alumnos!D498","v":0},{"$f":"IF(Tareas!$Y$1,Alumnos!E498*(30/Tareas!$Y$1),\"\")","v":0},{"$f":"Alumnos!F498","v":0},{"$f":"Alumnos!G498","v":0},{"$f":"Alumnos!H498","v":0},null,0,0,null,0]
[null,{"$f":"IF(Alumnos!B499<>\"\",Alumnos!B499,\"\")","v":""},{"$f":"IF(Tareas!$W$1,Alumnos!C499*(30/Tareas!$W$1),\"\")","v":0},{"$f":"Alumnos!D499","v":0},{"$f":"IF(Tareas!$Y$1,Alumnos!E499*(30/Tareas!$Y$1),\"\")","v":0},{"$f":"Alumnos!F499","v":0},{"$f":"Alumnos!G499","v":0},{"$f":"Alumnos!H499","v":0},null,0,0,null,0]
[null,{"$f":"IF(Alumnos!B500<>\"\",Alumnos!B500,\"\")","v":""},{"$f":"IF(Tareas!$W$1,Alumnos!C500*(30/Tareas!$W$1),\"\")","v":0},{"$f":"Alumnos!D500","v":0},{"$f":"IF(Tareas!$Y$1,Alumnos!E500*(30/Tareas!$Y$1),\"\")","v":0},{"$f":"Alumnos!F500","v":0},{"$f":"Alumnos!G500","v":0},{"$f":"Alumnos!H500","v":0},null,0,0,null,0]
[null,{"$f":"IF(Alumnos!B501<>\"\",Alumnos!B501,\"\")","v":""},{"$f":"IF(Tareas!$W$1,Alumnos!C501*(30/Tareas!$W$1),\"\")","v":0},{"$f":"Alumnos!D501","v":0},{"$f":"IF(Tareas!$Y$1,Alumnos!E501*(30/Tareas!$Y$1),\"\")","v":0},{"$f":"Alumnos!F501","v":0},{"$f":"Alumnos!G501","v":0},{"$f":"Alumnos!H501","v":0},null,0,0,null,0]

{"sheet":"Asistencia","index":4,"n_rows":501,"n_cols":2,"rows_kept":501,"cut":false,"hidden":false,"merged":[]}
[null,"ALUMNO"]
[null,{"$f":"IF(Alumnos!B2<>\"\",Alumnos!B2,\"\")","v":"Flores Tinajero Mauricio Gabriel"}]
[null,{"$f":"IF(Alumnos!B3<>\"\",Alumnos!B3,\"\")","v":"Granados Hernandez Brenda Paola "}]
[null,{"$f":"IF(Alumnos!B4<>\"\",Alumnos!B4,\"\")","v":"Ledezma Cano Andrea "}]
[null,{"$f":"IF(Alumnos!B5<>\"\",Alumnos!B5,\"\")","v":"Arturo"}]
[null,{"$f":"IF(Alumnos!B6<>\"\",Alumnos!B6,\"\")","v":"Michel"}]
[null,{"$f":"IF(Alumnos!B7<>\"\",Alumnos!B7,\"\")","v":""}]
[null,{"$f":"IF(Alumnos!B8<>\"\",Alumnos!B8,\"\")","v":""}]
[null,{"$f":"IF(Alumnos!B9<>\"\",Alumnos!B9,\"\")","v":""}]
[null,{"$f":"IF(Alumnos!B10<>\"\",Alumnos!B10,\"\")","v":""}]
[null,{"$f":"IF(Alumnos!B11<>\"\",Alumnos!B11,\"\")","v":""}]
[null,{"$f":"IF(Alumnos!B12<>\"\",Alumnos!B12,\"\")","v":""}]
[null,{"$f":"IF(Alumnos!B13<>\"\",Alumnos!B13,\"\")","v":""}]
[null,{"$f":"IF(Alumnos!B14<>\"\",Alumnos!B14,\"\")","v":""}]
[null,{"$f":"IF(Alumnos!B15<>\"\",Alumnos!B15,\"\")","v":""}]
[null,{"$f":"IF(Alumnos!B16<>\"\",Alumnos!B16,\"\")","v":""}]
[null,{"$f":"IF(Alumnos!B17<>\"\",Alumnos!B17,\"\")","v":""}]
[null,{"$f":"IF(Alumnos!B18<>\"\",Alumnos!B18,\"\")","v":""}]
[null,{"$f":"IF(Alumnos!B19<>\"\",Alumnos!B19,\"\")","v":""}]
[null,{"$f":"IF(Alumnos!B20<>\"\",Alumnos!B20,\"\")","v":""}]
[null,{"$f":"IF(Alumnos!B21<>\"\",Alumnos!B21,\"\")","v":""}]
[null,{"$f":"IF(Alumnos!B22<>\"\",Alumnos!B22,\"\")","v":""}]
[null,{"$f":"IF(Alumnos!B23<>\"\",Alumnos!B23,\"\")","v":""}]
[null,{"$f":"IF(Alumnos!B24<>\"\",Alumnos!B24,\"\")","v":""}]
[null,{"$f":"IF(Alumnos!B25<>\"\",Alumnos!B25,\"\")","v":""}]
[null,{"$f":"IF(Alumnos!B26<>\"\",Alumnos!B26,\"\")","v":""}]
[null,{"$f":"IF(Alumnos!B27<>\"\",Alumnos!B27,\"\")","v":""}]
[null,{"$f":"IF(Alumnos!B28<>\"\",Alumnos!B28,\"\")","v":""}]
[null,{"$f":"IF(Alumnos!B29<>\"\",Alumnos!B29,\"\")","v":""}]
[null,{"$f":"IF(Alumnos!B30<>\"\",Alumnos!B30,\"\")","v":""}]
[null,{"$f":"IF(Alumnos!B31<>\"\",Alumnos!B31,\"\")","v":""}]
[null,{"$f":"IF(Alumnos!B32<>\"\",Alumnos!B32,\"\")","v":""}]
[null,{"$f":"IF(Alumnos!B33<>\"\",Alumnos!B33,\"\")","v":""}]
[null,{"$f":"IF(Alumnos!B34<>\"\",Alumnos!B34,\"\")","v":""}]
[null,{"$f":"IF(Alumnos!B35<>\"\",Alumnos!B35,\"\")","v":""}]
[null,{"$f":"IF(Alumnos!B36<>\"\",Alumnos!B36,\"\")","v":""}]
[null,{"$f":"IF(Alumnos!B37<>\"\",Alumnos!B37,\"\")","v":""}]
[null,{"$f":"IF(Alumnos!B38<>\"\",Alumnos!B38,\"\")","v":""}]
[null,{"$f":"IF(Alumnos!B39<>\"\",Alumnos!B39,\"\")","v":""}]
[null,{"$f":"IF(Alumnos!B40<>\"\",Alumnos!B40,\"\")","v":""}]
[null,{"$f":"IF(Alumnos!B41<>\"\",Alumnos!B41,\"\")","v":""}]
[null,{"$f":"IF(Alumnos!B42<>\"\",Alumnos!B42,\"\")","v":""}]
[null,{"$f":"IF(Alumnos!B43<>\"\",Alumnos!B43,\"\")","v":""}]
[null,{"$f":"IF(Alumnos!B44<>\"\",Alumnos!B44,\"\")","v":""}]
[null,{"$f":"IF(Alumnos!B45<>\"\",Alumnos!B45,\"\")","v":""}]
[null,{"$f":"IF(Alumnos!B46<>\"\",Alumnos!B46,\"\")","v":""}]
[null,{"$f":"IF(Alumnos!B47<>\"\",Alumnos!B47,\"\")","v":""}]
[null,{"$f":"IF(Alumnos!B48<>\"\",Alumnos!B48,\"\")","v":""}]
[null,{"$f":"IF(Alumnos!B49<>\"\",Alumnos!B49,\"\")","v":""}]
[null,{"$f":"IF(Alumnos!B50<>\"\",Alumnos!B50,\"\")","v":""}]
[null,{"$f":"IF(Alumnos!B51<>\"\",Alumnos!B51,\"\")","v":""}]
[null,{"$f":"IF(Alumnos!B52<>\"\",Alumnos!B52,\"\")","v":""}]
[null,{"$f":"IF(Alumnos!B53<>\"\",Alumnos!B53,\"\")","v":""}]
[null,{"$f":"IF(Alumnos!B54<>\"\",Alumnos!B54,\"\")","v":""}]
[null,{"$f":"IF(Alumnos!B55<>\"\",Alumnos!B55,\"\")","v":""}]
[null,{"$f":"IF(Alumnos!B56<>\"\",Alumnos!B56,\"\")","v":""}]
[null,{"$f":"IF(Alumnos!B57<>\"\",Alumnos!B57,\"\")","v":""}]
[null,{"$f":"IF(Alumnos!B58<>\"\",Alumnos!B58,\"\")","v":""}]
[null,{"$f":"IF(Alumnos!B59<>\"\",Alumnos!B59,\"\")","v":""}]
[null,{"$f":"IF(Alumnos!B60<>\"\",Alumnos!B60,\"\")","v":""}]
[null,{"$f":"IF(Alumnos!B61<>\"\",Alumnos!B61,\"\")","v":""}]
[null,{"$f":"IF(Alumnos!B62<>\"\",Alumnos!B62,\"\")","v":""}]
[null,{"$f":"IF(Alumnos!B63<>\"\",Alumnos!B63,\"\")","v":""}]
[null,{"$f":"IF(Alumnos!B64<>\"\",Alumnos!B64,\"\")","v":""}]
[null,{"$f":"IF(Alumnos!B65<>\"\",Alumnos!B65,\"\")","v":""}]
[null,{"$f":"IF(Alumnos!B66<>\"\",Alumnos!B66,\"\")","v":""}]
[null,{"$f":"IF(Alumnos!B67<>\"\",Alumnos!B67,\"\")","v":""}]
[null,{"$f":"IF(Alumnos!B68<>\"\",Alumnos!B68,\"\")","v":""}]
[null,{"$f":"IF(Alumnos!B69<>\"\",Alumnos!B69,\"\")","v":""}]
[null,{"$f":"IF(Alumnos!B70<>\"\",Alumnos!B70,\"\")","v":""}]
[null,{"$f":"IF(Alumnos!B71<>\"\",Alumnos!B71,\"\")","v":""}]
[null,{"$f":"IF(Alumnos!B72<>\"\",Alumnos!B72,\"\")","v":""}]
[null,{"$f":"IF(Alumnos!B73<>\"\",Alumnos!B73,\"\")","v":""}]
[null,{"$f":"IF(Alumnos!B74<>\"\",Alumnos!B74,\"\")","v":""}]
[null,{"$f":"IF(Alumnos!B75<>\"\",Alumnos!B75,\"\")","v":""}]
[null,{"$f":"IF(Alumnos!B76<>\"\",Alumnos!B76,\"\")","v":""}]
[null,{"$f":"IF(Alumnos!B77<>\"\",Alumnos!B77,\"\")","v":""}]
[null,{"$f":"IF(Alumnos!B78<>\"\",Alumnos!B78,\"\")","v":""}]
[null,{"$f":"IF(Alumnos!B79<>\"\",Alumnos!B79,\"\")","v":""}]
[null,{"$f":"IF(Alumnos!B80<>\"\",Alumnos!B80,\"\")","v":""}]
[null,{"$f":"IF(Alumnos!B81<>\"\",Alumnos!B81,\"\")","v":""}]
[null,{"$f":"IF(Alumnos!B82<>\"\",Alumnos!B82,\"\")","v":""}]
[null,{"$f":"IF(Alumnos!B83<>\"\",Alumnos!B83,\"\")","v":""}]
[null,{"$f":"IF(Alumnos!B84<>\"\",Alumnos!B84,\"\")","v":""}]
[null,{"$f":"IF(Alumnos!B85<>\"\",Alumnos!B85,\"\")","v":""}]
[null,{"$f":"IF(Alumnos!B86<>\"\",Alumnos!B86,\"\")","v":""}]
[null,{"$f":"IF(Alumnos!B87<>\"\",Alumnos!B87,\"\")","v":""}]
[null,{"$f":"IF(Alumnos!B88<>\"\",Alumnos!B88,\"\")","v":""}]
[null,{"$f":"IF(Alumnos!B89<>\"\",Alumnos!B89,\"\")","v":""}]
[null,{"$f":"IF(Alumnos!B90<>\"\",Alumnos!B90,\"\")","v":""}]
[null,{"$f":"IF(Alumnos!B91<>\"\",Alumnos!B91,\"\")","v":""}]
[null,{"$f":"IF(Alumnos!B92<>\"\",Alumnos!B92,\"\")","v":""}]
[null,{"$f":"IF(Alumnos!B93<>\"\",Alumnos!B93,\"\")","v":""}]
[null,{"$f":"IF(Alumnos!B94<>\"\",Alumnos!B94,\"\")","v":""}]
[null,{"$f":"IF(Alumnos!B95<>\"\",Alumnos!B95,\"\")","v":""}]
[null,{"$f":"IF(Alumnos!B96<>\"\",Alumnos!B96,\"\")","v":""}]
[null,{"$f":"IF(Alumnos!B97<>\"\",Alumnos!B97,\"\")","v":""}]
[null,{"$f":"IF(Alumnos!B98<>\"\",Alumnos!B98,\"\")","v":""}]
[null,{"$f":"IF(Alumnos!B99<>\"\",Alumnos!B99,\"\")","v":""}]
[null,{"$f":"IF(Alumnos!B100<>\"\",Alumnos!B100,\"\")","v":""}]
[null,{"$f":"IF(Alumnos!B101<>\"\",Alumnos!B101,\"\")","v":""}]
[null,{"$f":"IF(Alumnos!B102<>\"\",Alumnos!B102,\"\")","v":""}]
[null,{"$f":"IF(Alumnos!B103<>\"\",Alumnos!B103,\"\")","v":""}]
[null,{"$f":"IF(Alumnos!B104<>\"\",Alumnos!B104,\"\")","v":""}]
[null,{"$f":"IF(Alumnos!B105<>\"\",Alumnos!B105,\"\")","v":""}]
[null,{"$f":"IF(Alumnos!B106<>\"\",Alumnos!B106,\"\")","v":""}]
[null,{"$f":"IF(Alumnos!B107<>\"\",Alumnos!B107,\"\")","v":""}]
[null,{"$f":"IF(Alumnos!B108<>\"\",Alumnos!B108,\"\")","v":""}]
[null,{"$f":"IF(Alumnos!B109<>\"\",Alumnos!B109,\"\")","v":""}]
[null,{"$f":"IF(Alumnos!B110<>\"\",Alumnos!B110,\"\")","v":""}]
[null,{"$f":"IF(Alumnos!B111<>\"\",Alumnos!B111,\"\")","v":""}]
[null,{"$f":"IF(Alumnos!B112<>\"\",Alumnos!B112,\"\")","v":""}]
[null,{"$f":"IF(Alumnos!B113<>\"\",Alumnos!B113,\"\")","v":""}]
[null,{"$f":"IF(Alumnos!B114<>\"\",Alumnos!B114,\"\")","v":""}]
[null,{"$f":"IF(Alumnos!B115<>\"\",Alumnos!B115,\"\")","v":""}]
[null,{"$f":"IF(Alumnos!B116<>\"\",Alumnos!B116,\"\")","v":""}]
[null,{"$f":"IF(Alumnos!B117<>\"\",Alumnos!B117,\"\")","v":""}]
[null,{"$f":"IF(Alumnos!B118<>\"\",Alumnos!B118,\"\")","v":""}]
[null,{"$f":"IF(Alumnos!B119<>\"\",Alumnos!B119,\"\")","v":""}]
[null,{"$f":"IF(Alumnos!B120<>\"\",Alumnos!B120,\"\")","v":""}]
[null,{"$f":"IF(Alumnos!B121<>\"\",Alumnos!B121,\"\")","v":""}]
[null,{"$f":"IF(Alumnos!B122<>\"\",Alumnos!B122,\"\")","v":""}]
[null,{"$f":"IF(Alumnos!B123<>\"\",Alumnos!B123,\"\")","v":""}]
[null,{"$f":"IF(Alumnos!B124<>\"\",Alumnos!B124,\"\")","v":""}]
[null,{"$f":"IF(Alumnos!B125<>\"\",Alumnos!B125,\"\")","v":""}]
[null,{"$f":"IF(Alumnos!B126<>\"\",Alumnos!B126,\"\")","v":""}]
[null,{"$f":"IF(Alumnos!B127<>\"\",Alumnos!B127,\"\")","v":""}]
[null,{"$f":"IF(Alumnos!B128<>\"\",Alumnos!B128,\"\")","v":""}]
[null,{"$f":"IF(Alumnos!B129<>\"\",Alumnos!B129,\"\")","v":""}]
[null,{"$f":"IF(Alumnos!B130<>\"\",Alumnos!B130,\"\")","v":""}]
[null,{"$f":"IF(Alumnos!B131<>\"\",Alumnos!B131,\"\")","v":""}]
[null,{"$f":"IF(Alumnos!B132<>\"\",Alumnos!B132,\"\")","v":""}]
[null,{"$f":"IF(Alumnos!B133<>\"\",Alumnos!B133,\"\")","v":""}]
[null,{"$f":"IF(Alumnos!B134<>\"\",Alumnos!B134,\"\")","v":""}]
[null,{"$f":"IF(Alumnos!B135<>\"\",Alumnos!B135,\"\")","v":""}]
[null,{"$f":"IF(Alumnos!B136<>\"\",Alumnos!B136,\"\")","v":""}]
[null,{"$f":"IF(Alumnos!B137<>\"\",Alumnos!B137,\"\")","v":""}]
[null,{"$f":"IF(Alumnos!B138<>\"\",Alumnos!B138,\"\")","v":""}]
[null,{"$f":"IF(Alumnos!B139<>\"\",Alumnos!B139,\"\")","v":""}]
[null,{"$f":"IF(Alumnos!B140<>\"\",Alumnos!B140,\"\")","v":""}]
[null,{"$f":"IF(Alumnos!B141<>\"\",Alumnos!B141,\"\")","v":""}]
[null,{"$f":"IF(Alumnos!B142<>\"\",Alumnos!B142,\"\")","v":""}]
[null,{"$f":"IF(Alumnos!B143<>\"\",Alumnos!B143,\"\")","v":""}]
[null,{"$f":"IF(Alumnos!B144<>\"\",Alumnos!B144,\"\")","v":""}]
[null,{"$f":"IF(Alumnos!B145<>\"\",Alumnos!B145,\"\")","v":""}]
[null,{"$f":"IF(Alumnos!B146<>\"\",Alumnos!B146,\"\")","v":""}]
[null,{"$f":"IF(Alumnos!B147<>\"\",Alumnos!B147,\"\")","v":""}]
[null,{"$f":"IF(Alumnos!B148<>\"\",Alumnos!B148,\"\")","v":""}]
[null,{"$f":"IF(Alumnos!B149<>\"\",Alumnos!B149,\"\")","v":""}]
[null,{"$f":"IF(Alumnos!B150<>\"\",Alumnos!B150,\"\")","v":""}]
[null,{"$f":"IF(Alumnos!B151<>\"\",Alumnos!B151,\"\")","v":""}]
[null,{"$f":"IF(Alumnos!B152<>\"\",Alumnos!B152,\"\")","v":""}]
[null,{"$f":"IF(Alumnos!B153<>\"\",Alumnos!B153,\"\")","v":""}]
[null,{"$f":"IF(Alumnos!B154<>\"\",Alumnos!B154,\"\")","v":""}]
[null,{"$f":"IF(Alumnos!B155<>\"\",Alumnos!B155,\"\")","v":""}]
[null,{"$f":"IF(Alumnos!B156<>\"\",Alumnos!B156,\"\")","v":""}]
[null,{"$f":"IF(Alumnos!B157<>\"\",Alumnos!B157,\"\")","v":""}]
[null,{"$f":"IF(Alumnos!B158<>\"\",Alumnos!B158,\"\")","v":""}]
[null,{"$f":"IF(Alumnos!B159<>\"\",Alumnos!B159,\"\")","v":""}]
[null,{"$f":"IF(Alumnos!B160<>\"\",Alumnos!B160,\"\")","v":""}]
[null,{"$f":"IF(Alumnos!B161<>\"\",Alumnos!B161,\"\")","v":""}]
[null,{"$f":"IF(Alumnos!B162<>\"\",Alumnos!B162,\"\")","v":""}]
[null,{"$f":"IF(Alumnos!B163<>\"\",Alumnos!B163,\"\")","v":""}]
[null,{"$f":"IF(Alumnos!B164<>\"\",Alumnos!B164,\"\")","v":""}]
[null,{"$f":"IF(Alumnos!B165<>\"\",Alumnos!B165,\"\")","v":""}]
[null,{"$f":"IF(Alumnos!B166<>\"\",Alumnos!B166,\"\")","v":""}]
[null,{"$f":"IF(Alumnos!B167<>\"\",Alumnos!B167,\"\")","v":""}]
[null,{"$f":"IF(Alumnos!B168<>\"\",Alumnos!B168,\"\")","v":""}]
[null,{"$f":"IF(Alumnos!B169<>\"\",Alumnos!B169,\"\")","v":""}]
[null,{"$f":"IF(Alumnos!B170<>\"\",Alumnos!B170,\"\")","v":""}]
[null,{"$f":"IF(Alumnos!B171<>\"\",Alumnos!B171,\"\")","v":""}]
[null,{"$f":"IF(Alumnos!B172<>\"\",Alumnos!B172,\"\")","v":""}]
[null,{"$f":"IF(Alumnos!B173<>\"\",Alumnos!B173,\"\")","v":""}]
[null,{"$f":"IF(Alumnos!B174<>\"\",Alumnos!B174,\"\")","v":""}]
[null,{"$f":"IF(Alumnos!B175<>\"\",Alumnos!B175,\"\")","v":""}]
[null,{"$f":"IF(Alumnos!B176<>\"\",Alumnos!B176,\"\")","v":""}]
[null,{"$f":"IF(Alumnos!B177<>\"\",Alumnos!B177,\"\")","v":""}]
[null,{"$f":"IF(Alumnos!B178<>\"\",Alumnos!B178,\"\")","v":""}]
[null,{"$f":"IF(Alumnos!B179<>\"\",Alumnos!B179,\"\")","v":""}]
[null,{"$f":"IF(Alumnos!B180<>\"\",Alumnos!B180,\"\")","v":""}]
[null,{"$f":"IF(Alumnos!B181<>\"\",Alumnos!B181,\"\")","v":""}]
[null,{"$f":"IF(Alumnos!B182<>\"\",Alumnos!B182,\"\")","v":""}]
[null,{"$f":"IF(Alumnos!B183<>\"\",Alumnos!B183,\"\")","v":""}]
[null,{"$f":"IF(Alumnos!B184<>\"\",Alumnos!B184,\"\")","v":""}]
[null,{"$f":"IF(Alumnos!B185<>\"\",Alumnos!B185,\"\")","v":""}]
[null,{"$f":"IF(Alumnos!B186<>\"\",Alumnos!B186,\"\")","v":""}]
[null,{"$f":"IF(Alumnos!B187<>\"\",Alumnos!B187,\"\")","v":""}]
[null,{"$f":"IF(Alumnos!B188<>\"\",Alumnos!B188,\"\")","v":""}]
[null,{"$f":"IF(Alumnos!B189<>\"\",Alumnos!B189,\"\")","v":""}]
[null,{"$f":"IF(Alumnos!B190<>\"\",Alumnos!B190,\"\")","v":""}]
[null,{"$f":"IF(Alumnos!B191<>\"\",Alumnos!B191,\"\")","v":""}]
[null,{"$f":"IF(Alumnos!B192<>\"\",Alumnos!B192,\"\")","v":""}]
[null,{"$f":"IF(Alumnos!B193<>\"\",Alumnos!B193,\"\")","v":""}]
[null,{"$f":"IF(Alumnos!B194<>\"\",Alumnos!B194,\"\")","v":""}]
[null,{"$f":"IF(Alumnos!B195<>\"\",Alumnos!B195,\"\")","v":""}]
[null,{"$f":"IF(Alumnos!B196<>\"\",Alumnos!B196,\"\")","v":""}]
[null,{"$f":"IF(Alumnos!B197<>\"\",Alumnos!B197,\"\")","v":""}]
[null,{"$f":"IF(Alumnos!B198<>\"\",Alumnos!B198,\"\")","v":""}]
[null,{"$f":"IF(Alumnos!B199<>\"\",Alumnos!B199,\"\")","v":""}]
[null,{"$f":"IF(Alumnos!B200<>\"\",Alumnos!B200,\"\")","v":""}]
[null,{"$f":"IF(Alumnos!B201<>\"\",Alumnos!B201,\"\")","v":""}]
[null,{"$f":"IF(Alumnos!B202<>\"\",Alumnos!B202,\"\")","v":""}]
[null,{"$f":"IF(Alumnos!B203<>\"\",Alumnos!B203,\"\")","v":""}]
[null,{"$f":"IF(Alumnos!B204<>\"\",Alumnos!B204,\"\")","v":""}]
[null,{"$f":"IF(Alumnos!B205<>\"\",Alumnos!B205,\"\")","v":""}]
[null,{"$f":"IF(Alumnos!B206<>\"\",Alumnos!B206,\"\")","v":""}]
[null,{"$f":"IF(Alumnos!B207<>\"\",Alumnos!B207,\"\")","v":""}]
[null,{"$f":"IF(Alumnos!B208<>\"\",Alumnos!B208,\"\")","v":""}]
[null,{"$f":"IF(Alumnos!B209<>\"\",Alumnos!B209,\"\")","v":""}]
[null,{"$f":"IF(Alumnos!B210<>\"\",Alumnos!B210,\"\")","v":""}]
[null,{"$f":"IF(Alumnos!B211<>\"\",Alumnos!B211,\"\")","v":""}]
[null,{"$f":"IF(Alumnos!B212<>\"\",Alumnos!B212,\"\")","v":""}]
[null,{"$f":"IF(Alumnos!B213<>\"\",Alumnos!B213,\"\")","v":""}]
[null,{"$f":"IF(Alumnos!B214<>\"\",Alumnos!B214,\"\")","v":""}]
[null,{"$f":"IF(Alumnos!B215<>\"\",Alumnos!B215,\"\")","v":""}]
[null,{"$f":"IF(Alumnos!B216<>\"\",Alumnos!B216,\"\")","v":""}]
[null,{"$f":"IF(Alumnos!B217<>\"\",Alumnos!B217,\"\")","v":""}]
[null,{"$f":"IF(Alumnos!B218<>\"\",Alumnos!B218,\"\")","v":""}]
[null,{"$f":"IF(Alumnos!B219<>\"\",Alumnos!B219,\"\")","v":""}]
[null,{"$f":"IF(Alumnos!B220<>\"\",Alumnos!B220,\"\")","v":""}]
[null,{"$f":"IF(Alumnos!B221<>\"\",Alumnos!B221,\"\")","v":""}]
[null,{"$f":"IF(Alumnos!B222<>\"\",Alumnos!B222,\"\")","v":""}]
[null,{"$f":"IF(Alumnos!B223<>\"\",Alumnos!B223,\"\")","v":""}]
[null,{"$f":"IF(Alumnos!B224<>\"\",Alumnos!B224,\"\")","v":""}]
[null,{"$f":"IF(Alumnos!B225<>\"\",Alumnos!B225,\"\")","v":""}]
[null,{"$f":"IF(Alumnos!B226<>\"\",Alumnos!B226,\"\")","v":""}]
[null,{"$f":"IF(Alumnos!B227<>\"\",Alumnos!B227,\"\")","v":""}]
[null,{"$f":"IF(Alumnos!B228<>\"\",Alumnos!B228,\"\")","v":""}]
[null,{"$f":"IF(Alumnos!B229<>\"\",Alumnos!B229,\"\")","v":""}]
[null,{"$f":"IF(Alumnos!B230<>\"\",Alumnos!B230,\"\")","v":""}]
[null,{"$f":"IF(Alumnos!B231<>\"\",Alumnos!B231,\"\")","v":""}]
[null,{"$f":"IF(Alumnos!B232<>\"\",Alumnos!B232,\"\")","v":""}]
[null,{"$f":"IF(Alumnos!B233<>\"\",Alumnos!B233,\"\")","v":""}]
[null,{"$f":"IF(Alumnos!B234<>\"\",Alumnos!B234,\"\")","v":""}]
[null,{"$f":"IF(Alumnos!B235<>\"\",Alumnos!B235,\"\")","v":""}]
[null,{"$f":"IF(Alumnos!B236<>\"\",Alumnos!B236,\"\")","v":""}]
[null,{"$f":"IF(Alumnos!B237<>\"\",Alumnos!B237,\"\")","v":""}]
[null,{"$f":"IF(Alumnos!B238<>\"\",Alumnos!B238,\"\")","v":""}]
[null,{"$f":"IF(Alumnos!B239<>\"\",Alumnos!B239,\"\")","v":""}]
[null,{"$f":"IF(Alumnos!B240<>\"\",Alumnos!B240,\"\")","v":""}]
[null,{"$f":"IF(Alumnos!B241<>\"\",Alumnos!B241,\"\")","v":""}]
[null,{"$f":"IF(Alumnos!B242<>\"\",Alumnos!B242,\"\")","v":""}]
[null,{"$f":"IF(Alumnos!B243<>\"\",Alumnos!B243,\"\")","v":""}]
[null,{"$f":"IF(Alumnos!B244<>\"\",Alumnos!B244,\"\")","v":""}]
[null,{"$f":"IF(Alumnos!B245<>\"\",Alumnos!B245,\"\")","v":""}]
[null,{"$f":"IF(Alumnos!B246<>\"\",Alumnos!B246,\"\")","v":""}]
[null,{"$f":"IF(Alumnos!B247<>\"\",Alumnos!B247,\"\")","v":""}]
[null,{"$f":"IF(Alumnos!B248<>\"\",Alumnos!B248,\"\")","v":""}]
[null,{"$f":"IF(Alumnos!B249<>\"\",Alumnos!B249,\"\")","v":""}]
[null,{"$f":"IF(Alumnos!B250<>\"\",Alumnos!B250,\"\")","v":""}]
[null,{"$f":"IF(Alumnos!B251<>\"\",Alumnos!B251,\"\")","v":""}]
[null,{"$f":"IF(Alumnos!B252<>\"\",Alumnos!B252,\"\")","v":""}]
[null,{"$f":"IF(Alumnos!B253<>\"\",Alumnos!B253,\"\")","v":""}]
[null,{"$f":"IF(Alumnos!B254<>\"\",Alumnos!B254,\"\")","v":""}]
[null,{"$f":"IF(Alumnos!B255<>\"\",Alumnos!B255,\"\")","v":""}]
[null,{"$f":"IF(Alumnos!B256<>\"\",Alumnos!B256,\"\")","v":""}]
[null,{"$f":"IF(Alumnos!B257<>\"\",Alumnos!B257,\"\")","v":""}]
[null,{"$f":"IF(Alumnos!B258<>\"\",Alumnos!B258,\"\")","v":""}]
[null,{"$f":"IF(Alumnos!B259<>\"\",Alumnos!B259,\"\")","v":""}]
[null,{"$f":"IF(Alumnos!B260<>\"\",Alumnos!B260,\"\")","v":""}]
[null,{"$f":"IF(Alumnos!B261<>\"\",Alumnos!B261,\"\")","v":""}]
[null,{"$f":"IF(Alumnos!B262<>\"\",Alumnos!B262,\"\")","v":""}]
[null,{"$f":"IF(Alumnos!B263<>\"\",Alumnos!B263,\"\")","v":""}]
[null,{"$f":"IF(Alumnos!B264<>\"\",Alumnos!B264,\"\")","v":""}]
[null,{"$f":"IF(Alumnos!B265<>\"\",Alumnos!B265,\"\")","v":""}]
[null,{"$f":"IF(Alumnos!B266<>\"\",Alumnos!B266,\"\")","v":""}]
[null,{"$f":"IF(Alumnos!B267<>\"\",Alumnos!B267,\"\")","v":""}]
[null,{"$f":"IF(Alumnos!B268<>\"\",Alumnos!B268,\"\")","v":""}]
[null,{"$f":"IF(Alumnos!B269<>\"\",Alumnos!B269,\"\")","v":""}]
[null,{"$f":"IF(Alumnos!B270<>\"\",Alumnos!B270,\"\")","v":""}]
[null,{"$f":"IF(Alumnos!B271<>\"\",Alumnos!B271,\"\")","v":""}]
[null,{"$f":"IF(Alumnos!B272<>\"\",Alumnos!B272,\"\")","v":""}]
[null,{"$f":"IF(Alumnos!B273<>\"\",Alumnos!B273,\"\")","v":""}]
[null,{"$f":"IF(Alumnos!B274<>\"\",Alumnos!B274,\"\")","v":""}]
[null,{"$f":"IF(Alumnos!B275<>\"\",Alumnos!B275,\"\")","v":""}]
[null,{"$f":"IF(Alumnos!B276<>\"\",Alumnos!B276,\"\")","v":""}]
[null,{"$f":"IF(Alumnos!B277<>\"\",Alumnos!B277,\"\")","v":""}]
[null,{"$f":"IF(Alumnos!B278<>\"\",Alumnos!B278,\"\")","v":""}]
[null,{"$f":"IF(Alumnos!B279<>\"\",Alumnos!B279,\"\")","v":""}]
[null,{"$f":"IF(Alumnos!B280<>\"\",Alumnos!B280,\"\")","v":""}]
[null,{"$f":"IF(Alumnos!B281<>\"\",Alumnos!B281,\"\")","v":""}]
[null,{"$f":"IF(Alumnos!B282<>\"\",Alumnos!B282,\"\")","v":""}]
[null,{"$f":"IF(Alumnos!B283<>\"\",Alumnos!B283,\"\")","v":""}]
[null,{"$f":"IF(Alumnos!B284<>\"\",Alumnos!B284,\"\")","v":""}]
[null,{"$f":"IF(Alumnos!B285<>\"\",Alumnos!B285,\"\")","v":""}]
[null,{"$f":"IF(Alumnos!B286<>\"\",Alumnos!B286,\"\")","v":""}]
[null,{"$f":"IF(Alumnos!B287<>\"\",Alumnos!B287,\"\")","v":""}]
[null,{"$f":"IF(Alumnos!B288<>\"\",Alumnos!B288,\"\")","v":""}]
[null,{"$f":"IF(Alumnos!B289<>\"\",Alumnos!B289,\"\")","v":""}]
[null,{"$f":"IF(Alumnos!B290<>\"\",Alumnos!B290,\"\")","v":""}]
[null,{"$f":"IF(Alumnos!B291<>\"\",Alumnos!B291,\"\")","v":""}]
[null,{"$f":"IF(Alumnos!B292<>\"\",Alumnos!B292,\"\")","v":""}]
[null,{"$f":"IF(Alumnos!B293<>\"\",Alumnos!B293,\"\")","v":""}]
[null,{"$f":"IF(Alumnos!B294<>\"\",Alumnos!B294,\"\")","v":""}]
[null,{"$f":"IF(Alumnos!B295<>\"\",Alumnos!B295,\"\")","v":""}]
[null,{"$f":"IF(Alumnos!B296<>\"\",Alumnos!B296,\"\")","v":""}]
[null,{"$f":"IF(Alumnos!B297<>\"\",Alumnos!B297,\"\")","v":""}]
[null,{"$f":"IF(Alumnos!B298<>\"\",Alumnos!B298,\"\")","v":""}]
[null,{"$f":"IF(Alumnos!B299<>\"\",Alumnos!B299,\"\")","v":""}]
[null,{"$f":"IF(Alumnos!B300<>\"\",Alumnos!B300,\"\")","v":""}]
[null,{"$f":"IF(Alumnos!B301<>\"\",Alumnos!B301,\"\")","v":""}]
[null,{"$f":"IF(Alumnos!B302<>\"\",Alumnos!B302,\"\")","v":""}]
[null,{"$f":"IF(Alumnos!B303<>\"\",Alumnos!B303,\"\")","v":""}]
[null,{"$f":"IF(Alumnos!B304<>\"\",Alumnos!B304,\"\")","v":""}]
[null,{"$f":"IF(Alumnos!B305<>\"\",Alumnos!B305,\"\")","v":""}]
[null,{"$f":"IF(Alumnos!B306<>\"\",Alumnos!B306,\"\")","v":""}]
[null,{"$f":"IF(Alumnos!B307<>\"\",Alumnos!B307,\"\")","v":""}]
[null,{"$f":"IF(Alumnos!B308<>\"\",Alumnos!B308,\"\")","v":""}]
[null,{"$f":"IF(Alumnos!B309<>\"\",Alumnos!B309,\"\")","v":""}]
[null,{"$f":"IF(Alumnos!B310<>\"\",Alumnos!B310,\"\")","v":""}]
[null,{"$f":"IF(Alumnos!B311<>\"\",Alumnos!B311,\"\")","v":""}]
[null,{"$f":"IF(Alumnos!B312<>\"\",Alumnos!B312,\"\")","v":""}]
[null,{"$f":"IF(Alumnos!B313<>\"\",Alumnos!B313,\"\")","v":""}]
[null,{"$f":"IF(Alumnos!B314<>\"\",Alumnos!B314,\"\")","v":""}]
[null,{"$f":"IF(Alumnos!B315<>\"\",Alumnos!B315,\"\")","v":""}]
[null,{"$f":"IF(Alumnos!B316<>\"\",Alumnos!B316,\"\")","v":""}]
[null,{"$f":"IF(Alumnos!B317<>\"\",Alumnos!B317,\"\")","v":""}]
[null,{"$f":"IF(Alumnos!B318<>\"\",Alumnos!B318,\"\")","v":""}]
[null,{"$f":"IF(Alumnos!B319<>\"\",Alumnos!B319,\"\")","v":""}]
[null,{"$f":"IF(Alumnos!B320<>\"\",Alumnos!B320,\"\")","v":""}]
[null,{"$f":"IF(Alumnos!B321<>\"\",Alumnos!B321,\"\")","v":""}]
[null,{"$f":"IF(Alumnos!B322<>\"\",Alumnos!B322,\"\")","v":""}]
[null,{"$f":"IF(Alumnos!B323<>\"\",Alumnos!B323,\"\")","v":""}]
[null,{"$f":"IF(Alumnos!B324<>\"\",Alumnos!B324,\"\")","v":""}]
[null,{"$f":"IF(Alumnos!B325<>\"\",Alumnos!B325,\"\")","v":""}]
[null,{"$f":"IF(Alumnos!B326<>\"\",Alumnos!B326,\"\")","v":""}]
[null,{"$f":"IF(Alumnos!B327<>\"\",Alumnos!B327,\"\")","v":""}]
[null,{"$f":"IF(Alumnos!B328<>\"\",Alumnos!B328,\"\")","v":""}]
[null,{"$f":"IF(Alumnos!B329<>\"\",Alumnos!B329,\"\")","v":""}]
[null,{"$f":"IF(Alumnos!B330<>\"\",Alumnos!B330,\"\")","v":""}]
[null,{"$f":"IF(Alumnos!B331<>\"\",Alumnos!B331,\"\")","v":""}]
[null,{"$f":"IF(Alumnos!B332<>\"\",Alumnos!B332,\"\")","v":""}]
[null,{"$f":"IF(Alumnos!B333<>\"\",Alumnos!B333,\"\")","v":""}]
[null,{"$f":"IF(Alumnos!B334<>\"\",Alumnos!B334,\"\")","v":""}]
[null,{"$f":"IF(Alumnos!B335<>\"\",Alumnos!B335,\"\")","v":""}]
[null,{"$f":"IF(Alumnos!B336<>\"\",Alumnos!B336,\"\")","v":""}]
[null,{"$f":"IF(Alumnos!B337<>\"\",Alumnos!B337,\"\")","v":""}]
[null,{"$f":"IF(Alumnos!B338<>\"\",Alumnos!B338,\"\")","v":""}]
[null,{"$f":"IF(Alumnos!B339<>\"\",Alumnos!B339,\"\")","v":""}]
[null,{"$f":"IF(Alumnos!B340<>\"\",Alumnos!B340,\"\")","v":""}]
[null,{"$f":"IF(Alumnos!B341<>\"\",Alumnos!B341,\"\")","v":""}]
[null,{"$f":"IF(Alumnos!B342<>\"\",Alumnos!B342,\"\")","v":""}]
[null,{"$f":"IF(Alumnos!B343<>\"\",Alumnos!B343,\"\")","v":""}]
[null,{"$f":"IF(Alumnos!B344<>\"\",Alumnos!B344,\"\")","v":""}]
[null,{"$f":"IF(Alumnos!B345<>\"\",Alumnos!B345,\"\")","v":""}]
[null,{"$f":"IF(Alumnos!B346<>\"\",Alumnos!B346,\"\")","v":""}]
[null,{"$f":"IF(Alumnos!B347<>\"\",Alumnos!B347,\"\")","v":""}]
[null,{"$f":"IF(Alumnos!B348<>\"\",Alumnos!B348,\"\")","v":""}]
[null,{"$f":"IF(Alumnos!B349<>\"\",Alumnos!B349,\"\")","v":""}]
[null,{"$f":"IF(Alumnos!B350<>\"\",Alumnos!B350,\"\")","v":""}]
[null,{"$f":"IF(Alumnos!B351<>\"\",Alumnos!B351,\"\")","v":""}]
[null,{"$f":"IF(Alumnos!B352<>\"\",Alumnos!B352,\"\")","v":""}]
[null,{"$f":"IF(Alumnos!B353<>\"\",Alumnos!B353,\"\")","v":""}]
[null,{"$f":"IF(Alumnos!B354<>\"\",Alumnos!B354,\"\")","v":""}]
[null,{"$f":"IF(Alumnos!B355<>\"\",Alumnos!B355,\"\")","v":""}]
[null,{"$f":"IF(Alumnos!B356<>\"\",Alumnos!B356,\"\")","v":""}]
[null,{"$f":"IF(Alumnos!B357<>\"\",Alumnos!B357,\"\")","v":""}]
[null,{"$f":"IF(Alumnos!B358<>\"\",Alumnos!B358,\"\")","v":""}]
[null,{"$f":"IF(Alumnos!B359<>\"\",Alumnos!B359,\"\")","v":""}]
[null,{"$f":"IF(Alumnos!B360<>\"\",Alumnos!B360,\"\")","v":""}]
[null,{"$f":"IF(Alumnos!B361<>\"\",Alumnos!B361,\"\")","v":""}]
[null,{"$f":"IF(Alumnos!B362<>\"\",Alumnos!B362,\"\")","v":""}]
[null,{"$f":"IF(Alumnos!B363<>\"\",Alumnos!B363,\"\")","v":""}]
[null,{"$f":"IF(Alumnos!B364<>\"\",Alumnos!B364,\"\")","v":""}]
[null,{"$f":"IF(Alumnos!B365<>\"\",Alumnos!B365,\"\")","v":""}]
[null,{"$f":"IF(Alumnos!B366<>\"\",Alumnos!B366,\"\")","v":""}]
[null,{"$f":"IF(Alumnos!B367<>\"\",Alumnos!B367,\"\")","v":""}]
[null,{"$f":"IF(Alumnos!B368<>\"\",Alumnos!B368,\"\")","v":""}]
[null,{"$f":"IF(Alumnos!B369<>\"\",Alumnos!B369,\"\")","v":""}]
[null,{"$f":"IF(Alumnos!B370<>\"\",Alumnos!B370,\"\")","v":""}]
[null,{"$f":"IF(Alumnos!B371<>\"\",Alumnos!B371,\"\")","v":""}]
[null,{"$f":"IF(Alumnos!B372<>\"\",Alumnos!B372,\"\")","v":""}]
[null,{"$f":"IF(Alumnos!B373<>\"\",Alumnos!B373,\"\")","v":""}]
[null,{"$f":"IF(Alumnos!B374<>\"\",Alumnos!B374,\"\")","v":""}]
[null,{"$f":"IF(Alumnos!B375<>\"\",Alumnos!B375,\"\")","v":""}]
[null,{"$f":"IF(Alumnos!B376<>\"\",Alumnos!B376,\"\")","v":""}]
[null,{"$f":"IF(Alumnos!B377<>\"\",Alumnos!B377,\"\")","v":""}]
[null,{"$f":"IF(Alumnos!B378<>\"\",Alumnos!B378,\"\")","v":""}]
[null,{"$f":"IF(Alumnos!B379<>\"\",Alumnos!B379,\"\")","v":""}]
[null,{"$f":"IF(Alumnos!B380<>\"\",Alumnos!B380,\"\")","v":""}]
[null,{"$f":"IF(Alumnos!B381<>\"\",Alumnos!B381,\"\")","v":""}]
[null,{"$f":"IF(Alumnos!B382<>\"\",Alumnos!B382,\"\")","v":""}]
[null,{"$f":"IF(Alumnos!B383<>\"\",Alumnos!B383,\"\")","v":""}]
[null,{"$f":"IF(Alumnos!B384<>\"\",Alumnos!B384,\"\")","v":""}]
[null,{"$f":"IF(Alumnos!B385<>\"\",Alumnos!B385,\"\")","v":""}]
[null,{"$f":"IF(Alumnos!B386<>\"\",Alumnos!B386,\"\")","v":""}]
[null,{"$f":"IF(Alumnos!B387<>\"\",Alumnos!B387,\"\")","v":""}]
[null,{"$f":"IF(Alumnos!B388<>\"\",Alumnos!B388,\"\")","v":""}]
[null,{"$f":"IF(Alumnos!B389<>\"\",Alumnos!B389,\"\")","v":""}]
[null,{"$f":"IF(Alumnos!B390<>\"\",Alumnos!B390,\"\")","v":""}]
[null,{"$f":"IF(Alumnos!B391<>\"\",Alumnos!B391,\"\")","v":""}]
[null,{"$f":"IF(Alumnos!B392<>\"\",Alumnos!B392,\"\")","v":""}]
[null,{"$f":"IF(Alumnos!B393<>\"\",Alumnos!B393,\"\")","v":""}]
[null,{"$f":"IF(Alumnos!B394<>\"\",Alumnos!B394,\"\")","v":""}]
[null,{"$f":"IF(Alumnos!B395<>\"\",Alumnos!B395,\"\")","v":""}]
[null,{"$f":"IF(Alumnos!B396<>\"\",Alumnos!B396,\"\")","v":""}]
[null,{"$f":"IF(Alumnos!B397<>\"\",Alumnos!B397,\"\")","v":""}]
[null,{"$f":"IF(Alumnos!B398<>\"\",Alumnos!B398,\"\")","v":""}]
[null,{"$f":"IF(Alumnos!B399<>\"\",Alumnos!B399,\"\")","v":""}]
[null,{"$f":"IF(Alumnos!B400<>\"\",Alumnos!B400,\"\")","v":""}]
[null,{"$f":"IF(Alumnos!B401<>\"\",Alumnos!B401,\"\")","v":""}]
[null,{"$f":"IF(Alumnos!B402<>\"\",Alumnos!B402,\"\")","v":""}]
[null,{"$f":"IF(Alumnos!B403<>\"\",Alumnos!B403,\"\")","v":""}]
[null,{"$f":"IF(Alumnos!B404<>\"\",Alumnos!B404,\"\")","v":""}]
[null,{"$f":"IF(Alumnos!B405<>\"\",Alumnos!B405,\"\")","v":""}]
[null,{"$f":"IF(Alumnos!B406<>\"\",Alumnos!B406,\"\")","v":""}]
[null,{"$f":"IF(Alumnos!B407<>\"\",Alumnos!B407,\"\")","v":""}]
[null,{"$f":"IF(Alumnos!B408<>\"\",Alumnos!B408,\"\")","v":""}]
[null,{"$f":"IF(Alumnos!B409<>\"\",Alumnos!B409,\"\")","v":""}]
[null,{"$f":"IF(Alumnos!B410<>\"\",Alumnos!B410,\"\")","v":""}]
[null,{"$f":"IF(Alumnos!B411<>\"\",Alumnos!B411,\"\")","v":""}]
[null,{"$f":"IF(Alumnos!B412<>\"\",Alumnos!B412,\"\")","v":""}]
[null,{"$f":"IF(Alumnos!B413<>\"\",Alumnos!B413,\"\")","v":""}]
[null,{"$f":"IF(Alumnos!B414<>\"\",Alumnos!B414,\"\")","v":""}]
[null,{"$f":"IF(Alumnos!B415<>\"\",Alumnos!B415,\"\")","v":""}]
[null,{"$f":"IF(Alumnos!B416<>\"\",Alumnos!B416,\"\")","v":""}]
[null,{"$f":"IF(Alumnos!B417<>\"\",Alumnos!B417,\"\")","v":""}]
[null,{"$f":"IF(Alumnos!B418<>\"\",Alumnos!B418,\"\")","v":""}]
[null,{"$f":"IF(Alumnos!B419<>\"\",Alumnos!B419,\"\")","v":""}]
[null,{"$f":"IF(Alumnos!B420<>\"\",Alumnos!B420,\"\")","v":""}]
[null,{"$f":"IF(Alumnos!B421<>\"\",Alumnos!B421,\"\")","v":""}]
[null,{"$f":"IF(Alumnos!B422<>\"\",Alumnos!B422,\"\")","v":""}]
[null,{"$f":"IF(Alumnos!B423<>\"\",Alumnos!B423,\"\")","v":""}]
[null,{"$f":"IF(Alumnos!B424<>\"\",Alumnos!B424,\"\")","v":""}]
[null,{"$f":"IF(Alumnos!B425<>\"\",Alumnos!B425,\"\")","v":""}]
[null,{"$f":"IF(Alumnos!B426<>\"\",Alumnos!B426,\"\")","v":""}]
[null,{"$f":"IF(Alumnos!B427<>\"\",Alumnos!B427,\"\")","v":""}]
[null,{"$f":"IF(Alumnos!B428<>\"\",Alumnos!B428,\"\")","v":""}]
[null,{"$f":"IF(Alumnos!B429<>\"\",Alumnos!B429,\"\")","v":""}]
[null,{"$f":"IF(Alumnos!B430<>\"\",Alumnos!B430,\"\")","v":""}]
[null,{"$f":"IF(Alumnos!B431<>\"\",Alumnos!B431,\"\")","v":""}]
[null,{"$f":"IF(Alumnos!B432<>\"\",Alumnos!B432,\"\")","v":""}]
[null,{"$f":"IF(Alumnos!B433<>\"\",Alumnos!B433,\"\")","v":""}]
[null,{"$f":"IF(Alumnos!B434<>\"\",Alumnos!B434,\"\")","v":""}]
[null,{"$f":"IF(Alumnos!B435<>\"\",Alumnos!B435,\"\")","v":""}]
[null,{"$f":"IF(Alumnos!B436<>\"\",Alumnos!B436,\"\")","v":""}]
[null,{"$f":"IF(Alumnos!B437<>\"\",Alumnos!B437,\"\")","v":""}]
[null,{"$f":"IF(Alumnos!B438<>\"\",Alumnos!B438,\"\")","v":""}]
[null,{"$f":"IF(Alumnos!B439<>\"\",Alumnos!B439,\"\")","v":""}]
[null,{"$f":"IF(Alumnos!B440<>\"\",Alumnos!B440,\"\")","v":""}]
[null,{"$f":"IF(Alumnos!B441<>\"\",Alumnos!B441,\"\")","v":""}]
[null,{"$f":"IF(Alumnos!B442<>\"\",Alumnos!B442,\"\")","v":""}]
[null,{"$f":"IF(Alumnos!B443<>\"\",Alumnos!B443,\"\")","v":""}]
[null,{"$f":"IF(Alumnos!B444<>\"\",Alumnos!B444,\"\")","v":""}]
[null,{"$f":"IF(Alumnos!B445<>\"\",Alumnos!B445,\"\")","v":""}]
[null,{"$f":"IF(Alumnos!B446<>\"\",Alumnos!B446,\"\")","v":""}]
[null,{"$f":"IF(Alumnos!B447<>\"\",Alumnos!B447,\"\")","v":""}]
[null,{"$f":"IF(Alumnos!B448<>\"\",Alumnos!B448,\"\")","v":""}]
[null,{"$f":"IF(Alumnos!B449<>\"\",Alumnos!B449,\"\")","v":""}]
[null,{"$f":"IF(Alumnos!B450<>\"\",Alumnos!B450,\"\")","v":""}]
[null,{"$f":"IF(Alumnos!B451<>\"\",Alumnos!B451,\"\")","v":""}]
[null,{"$f":"IF(Alumnos!B452<>\"\",Alumnos!B452,\"\")","v":""}]
[null,{"$f":"IF(Alumnos!B453<>\"\",Alumnos!B453,\"\")","v":""}]
[null,{"$f":"IF(Alumnos!B454<>\"\",Alumnos!B454,\"\")","v":""}]
[null,{"$f":"IF(Alumnos!B455<>\"\",Alumnos!B455,\"\")","v":""}]
[null,{"$f":"IF(Alumnos!B456<>\"\",Alumnos!B456,\"\")","v":""}]
[null,{"$f":"IF(Alumnos!B457<>\"\",Alumnos!B457,\"\")","v":""}]
[null,{"$f":"IF(Alumnos!B458<>\"\",Alumnos!B458,\"\")","v":""}]
[null,{"$f":"IF(Alumnos!B459<>\"\",Alumnos!B459,\"\")","v":""}]
[null,{"$f":"IF(Alumnos!B460<>\"\",Alumnos!B460,\"\")","v":""}]
[null,{"$f":"IF(Alumnos!B461<>\"\",Alumnos!B461,\"\")","v":""}]
[null,{"$f":"IF(Alumnos!B462<>\"\",Alumnos!B462,\"\")","v":""}]
[null,{"$f":"IF(Alumnos!B463<>\"\",Alumnos!B463,\"\")","v":""}]
[null,{"$f":"IF(Alumnos!B464<>\"\",Alumnos!B464,\"\")","v":""}]
[null,{"$f":"IF(Alumnos!B465<>\"\",Alumnos!B465,\"\")","v":""}]
[null,{"$f":"IF(Alumnos!B466<>\"\",Alumnos!B466,\"\")","v":""}]
[null,{"$f":"IF(Alumnos!B467<>\"\",Alumnos!B467,\"\")","v":""}]
[null,{"$f":"IF(Alumnos!B468<>\"\",Alumnos!B468,\"\")","v":""}]
[null,{"$f":"IF(Alumnos!B469<>\"\",Alumnos!B469,\"\")","v":""}]
[null,{"$f":"IF(Alumnos!B470<>\"\",Alumnos!B470,\"\")","v":""}]
[null,{"$f":"IF(Alumnos!B471<>\"\",Alumnos!B471,\"\")","v":""}]
[null,{"$f":"IF(Alumnos!B472<>\"\",Alumnos!B472,\"\")","v":""}]
[null,{"$f":"IF(Alumnos!B473<>\"\",Alumnos!B473,\"\")","v":""}]
[null,{"$f":"IF(Alumnos!B474<>\"\",Alumnos!B474,\"\")","v":""}]
[null,{"$f":"IF(Alumnos!B475<>\"\",Alumnos!B475,\"\")","v":""}]
[null,{"$f":"IF(Alumnos!B476<>\"\",Alumnos!B476,\"\")","v":""}]
[null,{"$f":"IF(Alumnos!B477<>\"\",Alumnos!B477,\"\")","v":""}]
[null,{"$f":"IF(Alumnos!B478<>\"\",Alumnos!B478,\"\")","v":""}]
[null,{"$f":"IF(Alumnos!B479<>\"\",Alumnos!B479,\"\")","v":""}]
[null,{"$f":"IF(Alumnos!B480<>\"\",Alumnos!B480,\"\")","v":""}]
[null,{"$f":"IF(Alumnos!B481<>\"\",Alumnos!B481,\"\")","v":""}]
[null,{"$f":"IF(Alumnos!B482<>\"\",Alumnos!B482,\"\")","v":""}]
[null,{"$f":"IF(Alumnos!B483<>\"\",Alumnos!B483,\"\")","v":""}]
[null,{"$f":"IF(Alumnos!B484<>\"\",Alumnos!B484,\"\")","v":""}]
[null,{"$f":"IF(Alumnos!B485<>\"\",Alumnos!B485,\"\")","v":""}]
[null,{"$f":"IF(Alumnos!B486<>\"\",Alumnos!B486,\"\")","v":""}]
[null,{"$f":"IF(Alumnos!B487<>\"\",Alumnos!B487,\"\")","v":""}]
[null,{"$f":"IF(Alumnos!B488<>\"\",Alumnos!B488,\"\")","v":""}]
[null,{"$f":"IF(Alumnos!B489<>\"\",Alumnos!B489,\"\")","v":""}]
[null,{"$f":"IF(Alumnos!B490<>\"\",Alumnos!B490,\"\")","v":""}]
[null,{"$f":"IF(Alumnos!B491<>\"\",Alumnos!B491,\"\")","v":""}]
[null,{"$f":"IF(Alumnos!B492<>\"\",Alumnos!B492,\"\")","v":""}]
[null,{"$f":"IF(Alumnos!B493<>\"\",Alumnos!B493,\"\")","v":""}]
[null,{"$f":"IF(Alumnos!B494<>\"\",Alumnos!B494,\"\")","v":""}]
[null,{"$f":"IF(Alumnos!B495<>\"\",Alumnos!B495,\"\")","v":""}]
[null,{"$f":"IF(Alumnos!B496<>\"\",Alumnos!B496,\"\")","v":""}]
[null,{"$f":"IF(Alumnos!B497<>\"\",Alumnos!B497,\"\")","v":""}]
[null,{"$f":"IF(Alumnos!B498<>\"\",Alumnos!B498,\"\")","v":""}]
[null,{"$f":"IF(Alumnos!B499<>\"\",Alumnos!B499,\"\")","v":""}]
[null,{"$f":"IF(Alumnos!B500<>\"\",Alumnos!B500,\"\")","v":""}]
[null,{"$f":"IF(Alumnos!B501<>\"\",Alumnos!B501,\"\")","v":""}]

{"sheet":"Hide","index":5,"n_rows":501,"n_cols":2,"rows_kept":501,"cut":false,"hidden":true,"merged":[[0,0,0,1]]}
["DD-MM-AAAA"]
[0,0]
[0,0]
[0,0]
[0,0]
[0,0]
[0,0]
[0,0]
[0,0]
[0,0]
[0,0]
[0,0]
[0,0]
[0,0]
[0,0]
[0,0]
[0,0]
[0,0]
[0,0]
[0,0]
[0,0]
[0,0]
[0,0]
[0,0]
[0,0]
[0,0]
[0,0]
[0,0]
[0,0]
[0,0]
[0,0]
[0,0]
[0,0]
[0,0]
[0,0]
[0,0]
[0,0]
[0,0]
[0,0]
[0,0]
[0,0]
[0,0]
[0,0]
[0,0]
[0,0]
[0,0]
[0,0]
[0,0]
[0,0]
[0,0]
[0,0]
[0,0]
[0,0]
[0,0]
[0,0]
[0,0]
[0,0]
[0,0]
[0,0]
[0,0]
[0,0]
[0,0]
[0,0]
[0,0]
[0,0]
[0,0]
[0,0]
[0,0]
[0,0]
[0,0]
[0,0]
[0,0]
[0,0]
[0,0]
[0,0]
[0,0]
[0,0]
[0,0]
[0,0]
[0,0]
[0,0]
[0,0]
[0,0]
[0,0]
[0,0]
[0,0]
[0,0]
[0,0]
[0,0]
[0,0]
[0,0]
[0,0]
[0,0]
[0,0]
[0,0]
[0,0]
[0,0]
[0,0]
[0,0]
[0,0]
[0,0]
[0,0]
[0,0]
[0,0]
[0,0]
[0,0]
[0,0]
[0,0]
[0,0]
[0,0]
[0,0]
[0,0]
[0,0]
[0,0]
[0,0]
[0,0]
[0,0]
[0,0]
[0,0]
[0,0]
[0,0]
[0,0]
[0,0]
[0,0]
[0,0]
[0,0]
[0,0]
[0,0]
[0,0]
[0,0]
[0,0]
[0,0]
[0,0]
[0,0]
[0,0]
[0,0]
[0,0]
[0,0]
[0,0]
[0,0]
[0,0]
[0,0]
[0,0]
[0,0]
[0,0]
[0,0]
[0,0]
[0,0]
[0,0]
[0,0]
[0,0]
[0,0]
[0,0]
[0,0]
[0,0]
[0,0]
[0,0]
[0,0]
[0,0]
[0,0]
[0,0]
[0,0]
[0,0]
[0,0]
[0,0]
[0,0]
[0,0]
[0,0]
[0,0]
[0,0]
[0,0]
[0,0]
[0,0]
[0,0]
[0,0]
[0,0]
[0,0]
[0,0]
[0,0]
[0,0]
[0,0]
[0,0]
[0,0]
[0,0]
[0,0]
[0,0]
[0,0]
[0,0]
[0,0]
[0,0]
[0,0]
[0,0]
[0,0]
[0,0]
[0,0]
[0,0]
[0,0]
[0,0]
[0,0]
[0,0]
[0,0]
[0,0]
[0,0]
[0,0]
[0,0]
[0,0]
[0,0]
[0,0]
[0,0]
[0,0]
[0,0]
[0,0]
[0,0]
[0,0]
[0,0]
[0,0]
[0,0]
[0,0]
[0,0]
[0,0]
[0,0]
[0,0]
[0,0]
[0,0]
[0,0]
[0,0]
[0,0]
[0,0]
[0,0]
[0,0]
[0,0]
[0,0]
[0,0]
[0,0]
[0,0]
[0,0]
[0,0]
[0,0]
[0,0]
[0,0]
[0,0]
[0,0]
[0,0]
[0,0]
[0,0]
[0,0]
[0,0]
[0,0]
[0,0]
[0,0]
[0,0]
[0,0]
[0,0]
[0,0]
[0,0]
[0,0]
[0,0]
[0,0]
[0,0]
[0,0]
[0,0]
[0,0]
[0,0]
[0,0]
[0,0]
[0,0]
[0,0]
[0,0]
[0,0]
[0,0]
[0,0]
[0,0]
[0,0]
[0,0]
[0,0]
[0,0]
[0,0]
[0,0]
[0,0]
[0,0]
[0,0]
[0,0]
[0,0]
[0,0]
[0,0]
[0,0]
[0,0]
[0,0]
[0,0]
[0,0]
[0,0]
[0,0]
[0,0]
[0,0]
[0,0]
[0,0]
[0,0]
[0,0]
[0,0]
[0,0]
[0,0]
[0,0]
[0,0]
[0,0]
[0,0]
[0,0]
[0,0]
[0,0]
[0,0]
[0,0]
[0,0]
[0,0]
[0,0]
[0,0]
[0,0]
[0,0]
[0,0]
[0,0]
[0,0]
[0,0]
[0,0]
[0,0]
[0,0]
[0,0]
[0,0]
[0,0]
[0,0]
[0,0]
[0,0]
[0,0]
[0,0]
[0,0]
[0,0]
[0,0]
[0,0]
[0,0]
[0,0]
[0,0]
[0,0]
[0,0]
[0,0]
[0,0]
[0,0]
[0,0]
[0,0]
[0,0]
[0,0]
[0,0]
[0,0]
[0,0]
[0,0]
[0,0]
[0,0]
[0,0]
[0,0]
[0,0]
[0,0]
[0,0]
[0,0]
[0,0]
[0,0]
[0,0]
[0,0]
[0,0]
[0,0]
[0,0]
[0,0]
[0,0]
[0,0]
[0,0]
[0,0]
[0,0]
[0,0]
[0,0]
[0,0]
[0,0]
[0,0]
[0,0]
[0,0]
[0,0]
[0,0]
[0,0]
[0,0]
[0,0]
[0,0]
[0,0]
[0,0]
[0,0]
[0,0]
[0,0]
[0,0]
[0,0]
[0,0]
[0,0]
[0,0]
[0,0]
[0,0]
[0,0]
[0,0]
[0,0]
[0,0]
[0,0]
[0,0]
[0,0]
[0,0]
[0,0]
[0,0]
[0,0]
[0,0]
[0,0]
[0,0]
[0,0]
[0,0]
[0,0]
[0,0]
[0,0]
[0,0]
[0,0]
[0,0]
[0,0]
[0,0]
[0,0]
[0,0]
[0,0]
[0,0]
[0,0]
[0,0]
[0,0]
[0,0]
[0,0]
[0,0]
[0,0]
[0,0]
[0,0]
[0,0]
[0,0]
[0,0]
[0,0]
[0,0]
[0,0]
[0,0]
[0,0]
[0,0]
[0,0]
[0,0]
[0,0]
[0,0]
[0,0]
[0,0]
[0,0]
[0,0]
[0,0]
[0,0]
[0,0]
[0,0]
[0,0]
[0,0]
[0,0]
[0,0]
[0,0]
[0,0]
[0,0]
[0,0]
[0,0]
[0,0]
[0,0]
[0,0]
[0,0]
[0,0]
[0,0]
[0,0]
[0,0]
[0,0]
[0,0]
[0,0]
[0,0]
[0,0]
[0,0]
[0,0]
[0,0]
[0,0]
[0,0]
[0,0]
[0,0]
[0,0]
[0,0]
[0,0]
[0,0]
[0,0]
[0,0]
[0,0]
[0,0]
[0,0]
[0,0]
[0,0]
[0,0]
[0,0]
[0,0]
[0,0]
[0,0]
[0,0]